program: Orca
programVersion: 5.0.3
elementType: C H C H C C C H H C H H C C H H H H H H H
charge: 1
multiplicity: 1
keywords: DSD-PBEP86 def2-TZVP D3BJ RIJCOSX verytightscf def2-TZVP/C def2/J soscf noTRAH
formula: C8H13
InChI: InChI=1/C8H13/c1-2-4-6-8-7-5-3-1/h1-2,7H,3-6,8H2
21 atoms
C  -1.998208 0.640503 0.077504
H  -2.175889 0.786747 1.149176
C  -1.786587 -0.952333 -0.171731
H  -2.637684 -1.437839 0.31488
C  -0.419777 -1.34399 0.368621
C  0.664809 -1.25847 -0.417734
C  1.967172 -0.706117 0.07008
H  2.152652 -0.939316 1.123621
H  2.832717 -1.034488 -0.515241
C  1.808628 0.836966 -0.11494
H  1.844176 1.095619 -1.179151
H  2.626947 1.371834 0.374888
C  0.455602 1.376048 0.503808
C  -0.725523 1.232788 -0.330139
H  0.519456 -1.220891 -1.500852
H  -1.848511 -1.142651 -1.247249
H  0.292002 0.993749 1.513419
H  -0.636363 1.58778 -1.361936
H  -2.84765 0.988568 -0.515952
H  0.600483 2.476781 0.569029
H  -0.313204 -1.408286 1.451876
totalener: -311.12233807 hartree
nucrepener: 379.53203776 hartree
electener: -690.65437583 hartree
oneelecener: -1159.50587277 hartree
twoeener: 468.85149694 hartree
kineticenergy: 310.00674009 hartree
exchangeener: -13.667007464521 hartree
correlationener: -0.921586633349 hartree
xcener: -14.588594097871 hartree
chargesum: 1.0000000
charge: -0.221779 0.183002 -0.215531 0.179759 -0.185175 -0.137877 -0.207397 0.154172 0.163908 -0.257951 0.152973 0.172764 -0.154456 0.117084 0.147802 0.173070 0.162424 0.218319 0.185434 0.204695 0.164759
charge: -0.183867 0.167700 -0.171158 0.152450 -0.144675 -0.144168 -0.219501 0.149395 0.151757 -0.192541 0.143886 0.150417 -0.205586 0.195723 0.151491 0.151975 0.160629 0.176266 0.160607 0.199928 0.149273
qa: -0.2218 0.1830 -0.2155 0.1798 -0.1852 -0.1379 -0.2074 0.1542 0.1639 -0.2580 0.1530 0.1728 -0.1545 0.1171 0.1478 0.1731 0.1624 0.2183 0.1854 0.2047 0.1648
va: 3.8543 0.9633 3.8538 0.9657 3.8683 3.8455 3.8819 0.9730 0.9721 3.8908 0.9688 0.9633 3.8315 3.4845 0.9672 0.9670 0.9807 0.9371 0.9670 0.9532 0.9650
total: -311.791742300 hartree
dispcorr: -0.011831737 hartree
energy: -311.803574036899
dipole: 0.38323 -1.06901 -0.68578 1.98252 -0.55547 1.42704 0.16522 -0.34676 -0.18154
magnitude: 1.59364 au
magnitude: 4.05072 debye
