program: Orca
programVersion: 5.0.3
elementType: C H C H C C C H H C H H C C H H H H H H H
charge: 1
multiplicity: 1
keywords: DSD-PBEP86/2013 def2-TZVP D3BJ RIJCOSX verytightscf def2-TZVP/C def2/J soscf noTRAH
formula: C8H13
InChI: InChI=1/C8H13/c1-2-4-6-8-7-5-3-1/h1-2,7H,3-6,8H2
21 atoms
C  -1.995967 0.535077 0.119647
H  -2.172473 0.725128 1.181986
C  -1.939149 -0.991995 -0.172408
H  -2.674167 -1.57969 0.3806
C  -0.507723 -1.166117 0.289423
C  0.615254 -1.141092 -0.497458
C  1.909629 -0.658405 0.067557
H  2.01632 -0.951618 1.117353
H  2.769241 -1.043285 -0.488166
C  1.883066 0.90487 -0.0442
H  1.993525 1.1912 -1.096864
H  2.733336 1.332326 0.493927
C  0.550293 1.481117 0.495134
C  -0.565357 0.873116 -0.273511
H  0.532917 -1.3058 -1.571456
H  -2.045514 -1.195955 -1.242148
H  0.429373 1.33886 1.573688
H  -0.433015 0.937214 -1.356526
H  -2.733235 1.085574 -0.474388
H  0.544408 2.567662 0.304009
H  -0.359879 -1.117185 1.369706
totalener: -311.16928692 hartree
nucrepener: 384.62672897 hartree
electener: -695.79601589 hartree
oneelecener: -1169.55848034 hartree
twoeener: 473.76246445 hartree
kineticenergy: 310.03094475 hartree
exchangeener: -14.129221904872 hartree
correlationener: -0.947329355141 hartree
xcener: -15.076551260014 hartree
chargesum: 1.0000000
charge: -0.203668 0.165030 -0.200557 0.177800 -0.088299 -0.083542 -0.223382 0.157684 0.174480 -0.235198 0.151027 0.173702 -0.202910 -0.001546 0.197005 0.160173 0.153692 0.189127 0.176989 0.186028 0.176363
charge: -0.194720 0.153781 -0.189428 0.149773 -0.063074 -0.043936 -0.209062 0.153667 0.156436 -0.206079 0.146262 0.150607 -0.223557 0.080211 0.162779 0.152341 0.152948 0.171467 0.153709 0.177977 0.167898
qa: -0.2037 0.1650 -0.2006 0.1778 -0.0883 -0.0835 -0.2234 0.1577 0.1745 -0.2352 0.1510 0.1737 -0.2029 -0.0015 0.1970 0.1602 0.1537 0.1891 0.1770 0.1860 0.1764
va: 3.8648 0.9730 3.8630 0.9718 3.8488 3.8256 3.9037 0.9694 0.9690 3.8679 0.9716 0.9659 3.9157 3.6756 0.9504 0.9741 0.9723 0.9516 0.9704 0.9638 0.9613
total: -311.824362314 hartree
dispcorr: -0.014091303 hartree
energy: -311.838453617374
dipole: 0.56306 -0.81851 -0.25545 1.85757 -1.58214 0.27543 0.17950 -0.35612 -0.17662
magnitude: 0.41510 au
magnitude: 1.05511 debye
