program: Orca
programVersion: 5.0.3
elementType: C H C H C C C H H C H H C C H H H H H H H
charge: 1
multiplicity: 1
keywords: m062x def2-TZVP EnGrad RIJCOSX verytightscf def2/J soscf
formula: C8H13
InChI: InChI=1/C8H13/c1-2-4-6-8-7-5-3-1/h1-2,7H,3-6,8H2
21 atoms
C  -1.99864 0.740193 0.076555
H  -2.189522 0.862388 1.146201
C  -1.747069 -0.940491 -0.147572
H  -2.61837 -1.33836 0.377924
C  -0.42637 -1.36954 0.403275
C  0.694078 -1.284067 -0.366973
C  2.006658 -0.687466 0.067245
H  2.219205 -0.878119 1.124935
H  2.858618 -1.026202 -0.526985
C  1.797813 0.887788 -0.145122
H  1.854647 1.130854 -1.2114
H  2.608443 1.422514 0.354925
C  0.422771 1.257858 0.455117
C  -0.755925 1.317662 -0.377311
H  0.529621 -1.21325 -1.446726
H  -1.844554 -1.123685 -1.218886
H  0.118308 0.310124 0.967057
H  -0.630205 1.419229 -1.459126
H  -2.872845 0.985835 -0.526567
H  0.39291 1.896097 1.352771
H  -0.346121 -1.513078 1.48242
totalener: -312.24717022 hartree
nucrepener: 380.60832536 hartree
electener: -692.85549558 hartree
oneelecener: -1161.90093833 hartree
twoeener: 469.04544275 hartree
kineticenergy: 310.36985201 hartree
xcener: -23.091692336549 hartree
chargesum: 1.0000000
charge: -0.323439 0.226599 -0.319674 0.215242 -0.167747 -0.112536 -0.320679 0.202020 0.196328 -0.347114 0.203640 0.198063 -0.216335 0.084778 0.177879 0.218923 0.170427 0.221684 0.215642 0.259931 0.216369
charge: -0.176784 0.168034 -0.149852 0.165763 -0.199997 -0.108186 -0.219193 0.154702 0.153956 -0.207285 0.150014 0.156877 -0.218765 0.090333 0.157202 0.157985 0.233072 0.173057 0.164680 0.196753 0.157632
qa: -0.3234 0.2266 -0.3197 0.2152 -0.1677 -0.1125 -0.3207 0.2020 0.1963 -0.3471 0.2036 0.1981 -0.2163 0.0848 0.1779 0.2189 0.1704 0.2217 0.2156 0.2599 0.2164
va: 3.7315 0.9409 3.7543 0.9488 3.5656 3.7149 3.7245 0.9484 0.9616 3.7578 0.9465 0.9605 3.5941 3.5058 0.9531 0.9405 0.9864 0.9396 0.9549 0.9308 0.9426
energy: -312.247170222173
dipole: 0.07513 -0.79068 -0.71556 0.87611 0.00606 0.88218 0.39056 -0.44905 -0.05849
magnitude: 1.13740 au
magnitude: 2.89104 debye
