program: Orca
programVersion: 5.0.3
elementType: C H C H C C C H H C H H C C H H H H H H H
charge: 1
multiplicity: 1
keywords: b3lyp def2-TZVP EnGrad RIJCOSX verytightscf def2/J soscf
formula: C8H13
InChI: InChI=1/C8H12.H/c1-2-4-6-8-7-5-3-1;/h1-2,7-8H,3-6H2;
21 atoms
C  -1.982255 0.65804 0.117092
H  -2.149551 0.849552 1.181618
C  -1.843332 -0.944021 -0.123823
H  -2.65064 -1.440419 0.417651
C  -0.46539 -1.342671 0.380296
C  0.67756 -1.263252 -0.378552
C  1.983096 -0.658712 0.105221
H  2.154188 -0.859768 1.167393
H  2.846063 -1.011422 -0.462468
C  1.843808 0.944671 -0.121309
H  1.952213 1.167941 -1.187387
H  2.651524 1.437629 0.422719
C  0.466224 1.336778 0.389917
C  -0.679675 1.268392 -0.366187
H  0.547446 -1.264029 -1.464184
H  -1.954702 -1.157391 -1.191602
H  0.000677 0.001767 0.03262
H  -0.553923 1.281958 -1.452198
H  -2.847783 1.014456 -0.444313
H  0.350159 1.326738 1.476332
H  -0.346542 -1.345174 1.466979
totalener: -312.18763835 hartree
nucrepener: 382.90943967 hartree
electener: -695.09707802 hartree
oneelecener: -1166.35309394 hartree
twoeener: 471.25601592 hartree
kineticenergy: 310.50242785 hartree
exchangeener: -36.319006672534 hartree
correlationener: -2.309260241990 hartree
xcener: -38.628266914523 hartree
chargesum: 1.0000000
charge: -0.221241 0.157198 -0.226669 0.171600 -0.071356 -0.057242 -0.221473 0.157088 0.170856 -0.227015 0.157598 0.171610 -0.070075 -0.057056 0.157376 0.157654 0.201369 0.157625 0.170944 0.160697 0.160513
charge: -0.195044 0.153135 -0.194660 0.156960 -0.115110 -0.103959 -0.195177 0.153075 0.156955 -0.194651 0.152986 0.156936 -0.115101 -0.102649 0.163981 0.153006 0.320541 0.164030 0.157026 0.163902 0.163815
qa: -0.2212 0.1572 -0.2267 0.1716 -0.0714 -0.0572 -0.2215 0.1571 0.1709 -0.2270 0.1576 0.1716 -0.0701 -0.0571 0.1574 0.1577 0.2014 0.1576 0.1709 0.1607 0.1605
va: 3.8761 0.9683 3.8832 0.9672 3.7908 3.7981 3.8767 0.9684 0.9673 3.8837 0.9682 0.9673 3.7878 3.7999 0.9637 0.9682 0.9698 0.9636 0.9672 0.9635 0.9634
energy: -312.187638347698
dipole: -0.00077 -0.00163 -0.00240 0.00256 0.00261 0.00517 -0.03398 0.02789 -0.00609
magnitude: 0.00834 au
magnitude: 0.02120 debye
