program: Orca
programVersion: 5.0.3
elementType: C H C H C C C H H C H H C C H H H H H H H
charge: 1
multiplicity: 1
keywords: m062x cc-pVTZ EnGrad RIJCOSX verytightscf cc-pVTZ/C def2/J soscf
formula: C8H13
InChI: InChI=1/C8H13/c1-2-4-6-8-7-5-3-1/h1-2,7H,3-6,8H2
21 atoms
C  -2.003025 0.738699 0.069816
H  -2.169705 0.806221 1.147825
C  -1.73502 -0.975447 -0.167607
H  -2.621236 -1.347979 0.351131
C  -0.41047 -1.38299 0.385562
C  0.679651 -1.269789 -0.391034
C  1.993578 -0.702335 0.063569
H  2.195041 -0.915846 1.118673
H  2.851588 -1.03786 -0.525997
C  1.789247 0.836024 -0.130288
H  1.822142 1.099763 -1.19328
H  2.595381 1.386154 0.362362
C  0.428567 1.303197 0.497555
C  -0.763707 1.286632 -0.352572
H  0.515814 -1.188527 -1.470242
H  -1.828479 -1.13776 -1.242397
H  0.230332 0.794153 1.443702
H  -0.658574 1.63751 -1.383187
H  -2.879063 0.997215 -0.524189
H  0.525597 2.383036 0.750468
H  -0.322497 -1.465842 1.468071
totalener: -312.27360108 hartree
nucrepener: 379.08239171 hartree
electener: -691.35599278 hartree
oneelecener: -1158.94221730 hartree
twoeener: 467.58622451 hartree
kineticenergy: 310.03146410 hartree
xcener: -23.082564280591 hartree
chargesum: 1.0000000
charge: -0.329070 0.226667 -0.281153 0.206052 -0.162863 -0.125809 -0.299082 0.181536 0.184163 -0.285406 0.181943 0.187901 -0.275630 0.107160 0.185416 0.207672 0.181876 0.263430 0.205109 0.232534 0.207553
charge: 0.128098 0.014299 0.169988 0.005351 0.021389 0.057777 0.070367 -0.002375 -0.000522 0.105446 -0.009480 0.000296 0.078728 0.312751 -0.015925 -0.000783 0.006805 0.022842 0.006117 0.049922 -0.021091
qa: -0.3291 0.2267 -0.2812 0.2061 -0.1629 -0.1258 -0.2991 0.1815 0.1842 -0.2854 0.1819 0.1879 -0.2756 0.1072 0.1854 0.2077 0.1819 0.2634 0.2051 0.2325 0.2076
va: 3.7436 0.9411 3.7672 0.9493 3.6160 3.6551 3.7759 0.9611 0.9600 3.7285 0.9563 0.9542 3.7498 3.3472 0.9576 0.9482 0.9709 0.9230 0.9597 0.9415 0.9526
energy: -312.273601075052
dipole: 0.24005 -1.07938 -0.83934 1.88234 -0.64443 1.23791 0.28364 -0.42894 -0.14530
magnitude: 1.50267 au
magnitude: 3.81949 debye
