program: Orca
programVersion: 5.0.3
elementType: C H C H C C C H H C H H C C H H H H H H H
charge: 1
multiplicity: 1
keywords: DSD-PBEP86 cc-pVTZ EnGrad RIJCOSX verytightscf cc-pVTZ/C def2/J soscf
formula: C8H13
InChI: InChI=1/C8H13/c1-3-7-5-2-6-8(4-1)9-7/h3,6-8H,1-2,4-5H2
21 atoms
C  -2.00546 0.689551 0.091679
H  -2.215572 0.876435 1.149048
C  -1.800155 -0.92128 -0.136855
H  -2.629573 -1.417918 0.369778
C  -0.440501 -1.336348 0.408119
C  0.697625 -1.277899 -0.361988
C  2.009349 -0.681833 0.081638
H  2.222336 -0.881684 1.136275
H  2.85593 -1.013447 -0.522296
C  1.812056 0.915343 -0.137102
H  1.87913 1.138123 -1.206832
H  2.629379 1.429288 0.371956
C  0.438103 1.305518 0.412471
C  -0.710147 1.302012 -0.356401
H  0.533132 -1.208384 -1.44157
H  -1.8734 -1.13217 -1.208231
H  0.009233 0.024839 0.292343
H  -0.559231 1.27567 -1.439629
H  -2.860071 1.006675 -0.508208
H  0.342339 1.410363 1.496632
H  -0.34426 -1.451814 1.490245
totalener: -311.09748972 hartree
nucrepener: 382.64978840 hartree
electener: -693.74727812 hartree
oneelecener: -1165.21651924 hartree
twoeener: 471.46924112 hartree
kineticenergy: 309.65784034 hartree
exchangeener: -12.748476056131 hartree
correlationener: -0.949101778640 hartree
xcener: -13.697577834771 hartree
chargesum: 1.0000000
charge: -0.253467 0.176428 -0.274589 0.188577 -0.076964 -0.049819 -0.251727 0.173691 0.188097 -0.270350 0.171877 0.187961 -0.079345 -0.039015 0.182958 0.173363 0.077537 0.188096 0.189613 0.198700 0.198377
charge: 0.106450 -0.001994 0.114423 0.001526 0.112864 0.153475 0.103046 -0.002488 0.002501 0.114501 -0.004305 0.001085 0.119901 0.170766 0.001962 -0.004324 -0.008789 0.003975 0.003178 0.008986 0.003261
qa: -0.2535 0.1764 -0.2746 0.1886 -0.0770 -0.0498 -0.2517 0.1737 0.1881 -0.2703 0.1719 0.1880 -0.0793 -0.0390 0.1830 0.1734 0.0775 0.1881 0.1896 0.1987 0.1984
va: 3.8882 0.9801 3.9250 0.9730 3.7895 3.8103 3.8893 0.9813 0.9720 3.9224 0.9818 0.9738 3.7897 3.7958 0.9817 0.9808 1.1382 0.9792 0.9720 0.9792 0.9782
energy: -311.814093819964
dipole: -0.00994 -0.03386 -0.04380 0.05284 0.01919 0.07202 -0.01901 0.00441 -0.01460
magnitude: 0.08555 au
magnitude: 0.21745 debye
