program: Orca
programVersion: 5.0.3
elementType: C H C H C C C H H C H H C C H H H H H H H
charge: 1
multiplicity: 1
keywords: DSD-PBEP86 cc-pVTZ EnGrad RIJCOSX verytightscf cc-pVTZ/C def2/J soscf
formula: C8H13
InChI: InChI=1/C8H13/c1-2-4-6-8-7-5-3-1/h1-2,7H,3-6,8H2
21 atoms
C  -2.002717 0.744077 0.069481
H  -2.167802 0.809346 1.147753
C  -1.733182 -0.975546 -0.166484
H  -2.620441 -1.34225 0.354349
C  -0.410888 -1.384523 0.386767
C  0.680727 -1.270444 -0.389007
C  1.995059 -0.700822 0.0632
H  2.19762 -0.912035 1.118581
H  2.852434 -1.037433 -0.526499
C  1.788498 0.838158 -0.131724
H  1.821687 1.102057 -1.194649
H  2.594062 1.388677 0.361401
C  0.427057 1.29626 0.497062
C  -0.764784 1.288848 -0.355625
H  0.516322 -1.189324 -1.46816
H  -1.828684 -1.136641 -1.241134
H  0.224829 0.768347 1.432108
H  -0.658745 1.63631 -1.387205
H  -2.880483 0.99784 -0.52374
H  0.518051 2.369713 0.777047
H  -0.323989 -1.469334 1.469187
totalener: -311.13467616 hartree
nucrepener: 379.11754861 hartree
electener: -690.25222477 hartree
oneelecener: -1158.65235406 hartree
twoeener: 468.40012928 hartree
kineticenergy: 309.72972906 hartree
exchangeener: -12.751569584409 hartree
correlationener: -0.942497977665 hartree
xcener: -13.694067562074 hartree
chargesum: 1.0000000
charge: -0.269519 0.202924 -0.239976 0.200408 -0.163085 -0.129062 -0.239563 0.160175 0.176514 -0.257022 0.160045 0.179284 -0.246335 0.093686 0.166004 0.191450 0.164889 0.240252 0.203364 0.215047 0.190519
charge: 0.131295 0.014330 0.174325 0.005793 0.022496 0.059986 0.071040 -0.003482 -0.001388 0.105150 -0.010575 -0.000708 0.078680 0.310966 -0.016785 -0.001086 0.006368 0.020977 0.006193 0.048200 -0.021774
qa: -0.2695 0.2029 -0.2400 0.2004 -0.1631 -0.1291 -0.2396 0.1602 0.1765 -0.2570 0.1600 0.1793 -0.2463 0.0937 0.1660 0.1915 0.1649 0.2403 0.2034 0.2150 0.1905
va: 3.8838 0.9702 3.9049 0.9652 3.8160 3.8478 3.9048 0.9860 0.9768 3.8887 0.9832 0.9734 3.9155 3.5528 0.9829 0.9719 0.9945 0.9530 0.9732 0.9632 0.9788
energy: -311.836270127519
dipole: 0.22929 -1.11062 -0.88133 1.85902 -0.65573 1.20329 0.29872 -0.43866 -0.13994
magnitude: 1.49808 au
magnitude: 3.80781 debye
