program: Orca
programVersion: 5.0.3
elementType: C H C H C C C H H C H H C C H H H H H H H
charge: 1
multiplicity: 1
keywords: b3lyp cc-pVTZ EnGrad D3BJ RIJCOSX verytightscf cc-pVTZ/C def2/J soscf
formula: C8H13
InChI: InChI=1/C8H13/c1-2-4-6-8-7-5-3-1/h1-2,7H,3-6,8H2
21 atoms
C  -1.99778 0.528988 0.119815
H  -2.175937 0.722721 1.181077
C  -1.958015 -0.998063 -0.169806
H  -2.676103 -1.59163 0.398134
C  -0.519346 -1.136076 0.281257
C  0.609477 -1.120939 -0.504701
C  1.906967 -0.650818 0.064379
H  2.006436 -0.952499 1.112471
H  2.761274 -1.04496 -0.492599
C  1.896647 0.914378 -0.034582
H  2.024853 1.208304 -1.082965
H  2.743524 1.32684 0.520124
C  0.558315 1.481307 0.489557
C  -0.546097 0.81815 -0.262587
H  0.530192 -1.299242 -1.576661
H  -2.074265 -1.208557 -1.237012
H  0.442459 1.361496 1.57165
H  -0.421125 0.881866 -1.346495
H  -2.713954 1.099968 -0.479528
H  0.521039 2.560947 0.272778
H  -0.369002 -1.08506 1.360873
totalener: -312.25030087 hartree
nucrepener: 385.59551521 hartree
electener: -697.84581608 hartree
oneelecener: -1172.04932240 hartree
twoeener: 474.20350632 hartree
kineticenergy: 310.00513581 hartree
exchangeener: -36.323230993352 hartree
correlationener: -2.308861855115 hartree
xcener: -38.632092848467 hartree
chargesum: 1.0000000
charge: -0.161105 0.140470 -0.173677 0.153888 -0.036310 -0.036433 -0.186769 0.135416 0.154628 -0.190016 0.132504 0.152273 -0.168208 -0.036018 0.187204 0.138170 0.134572 0.173533 0.153542 0.167275 0.165061
charge: 0.100551 -0.001387 0.104601 -0.002298 0.124770 0.162381 0.086093 0.000316 0.005742 0.101994 -0.007186 -0.001180 0.069927 0.229806 -0.000957 -0.001650 -0.002368 0.001433 -0.000228 0.023101 0.006541
qa: -0.1611 0.1405 -0.1737 0.1539 -0.0363 -0.0364 -0.1868 0.1354 0.1546 -0.1900 0.1325 0.1523 -0.1682 -0.0360 0.1872 0.1382 0.1346 0.1735 0.1535 0.1673 0.1651
va: 3.8244 0.9919 3.8412 0.9834 3.7642 3.7535 3.8738 0.9907 0.9831 3.8411 0.9877 0.9807 3.8487 3.6783 0.9772 0.9930 0.9915 0.9911 0.9814 0.9757 0.9931
dispcorr: -0.035391038 hartree
energy: -312.285691913007
dipole: 0.56170 -0.71388 -0.15218 1.85360 -1.74144 0.11215 0.18900 -0.33909 -0.15009
magnitude: 0.24138 au
magnitude: 0.61353 debye
