program: Orca
programVersion: 5.0.3
elementType: C H C H C C C H H C H H C C H H H H H H H
charge: 1
multiplicity: 1
keywords: DSD-PBEP86/2013 def2-TZVP D3BJ RIJCOSX verytightscf def2-TZVP/C def2/J soscf noTRAH
formula: C8H13
InChI: InChI=1/C8H13/c1-2-4-6-8-7-5-3-1/h1-2,7H,3-6,8H2
21 atoms
C  -2.001526 0.683085 0.073948
H  -2.177148 0.792327 1.148996
C  -1.760842 -0.962024 -0.172013
H  -2.630623 -1.398729 0.32691
C  -0.412113 -1.363819 0.375976
C  0.670936 -1.265213 -0.406151
C  1.979287 -0.707771 0.067492
H  2.171943 -0.934104 1.121385
H  2.842533 -1.037132 -0.519618
C  1.799836 0.831751 -0.121115
H  1.83386 1.092782 -1.184755
H  2.610917 1.375829 0.37035
C  0.4425 1.349196 0.500277
C  -0.746418 1.261009 -0.335913
H  0.515765 -1.198539 -1.487283
H  -1.835842 -1.1413 -1.247283
H  0.267383 0.932158 1.493932
H  -0.651414 1.620099 -1.365599
H  -2.862765 0.990204 -0.522123
H  0.573359 2.448711 0.61797
H  -0.315027 -1.434675 1.45913
totalener: -311.13724625 hartree
nucrepener: 379.19106155 hartree
electener: -690.32830780 hartree
oneelecener: -1158.84305364 hartree
twoeener: 468.51474584 hartree
kineticenergy: 310.01374718 hartree
exchangeener: -14.121917269028 hartree
correlationener: -0.942761717486 hartree
xcener: -15.064678986514 hartree
chargesum: 1.0000000
charge: -0.244038 0.189559 -0.211149 0.184336 -0.193360 -0.124686 -0.207261 0.153198 0.163675 -0.263352 0.153390 0.171782 -0.153338 0.119832 0.141617 0.179183 0.161684 0.218691 0.189487 0.205353 0.165398
charge: -0.175775 0.168902 -0.147618 0.153945 -0.162184 -0.140733 -0.219012 0.149157 0.150532 -0.195184 0.143673 0.150599 -0.203106 0.176601 0.151057 0.151637 0.161438 0.176421 0.159678 0.201212 0.148762
qa: -0.2440 0.1896 -0.2111 0.1843 -0.1934 -0.1247 -0.2073 0.1532 0.1637 -0.2634 0.1534 0.1718 -0.1533 0.1198 0.1416 0.1792 0.1617 0.2187 0.1895 0.2054 0.1654
va: 3.8668 0.9613 3.8445 0.9629 3.8672 3.8451 3.8785 0.9732 0.9723 3.8998 0.9683 0.9638 3.8249 3.5007 0.9683 0.9634 0.9824 0.9384 0.9663 0.9518 0.9655
total: -311.788739441 hartree
dispcorr: -0.014123262 hartree
energy: -311.802862703007
dipole: 0.32115 -1.09298 -0.77183 1.97318 -0.54821 1.42497 0.19851 -0.38229 -0.18378
magnitude: 1.63096 au
magnitude: 4.14558 debye
