program: Orca
programVersion: 5.0.3
elementType: C H C H C C C H H C H H C C H H H H H H H
charge: 1
multiplicity: 1
keywords: DSD-PBEP86 cc-pVTZ EnGrad RIJCOSX verytightscf cc-pVTZ/C def2/J soscf
formula: C8H13
InChI: InChI=1/C8H13/c1-2-4-6-8-7-5-3-1/h1-2,7H,3-6,8H2
21 atoms
C  -1.989882 0.570377 0.098425
H  -2.166428 0.750751 1.164138
C  -1.856434 -0.968164 -0.174319
H  -2.659115 -1.515186 0.327632
C  -0.457667 -1.27734 0.335576
C  0.640117 -1.218003 -0.455802
C  1.932067 -0.688076 0.072655
H  2.081688 -0.945664 1.126391
H  2.800774 -1.037109 -0.495145
C  1.836258 0.864184 -0.087615
H  1.890204 1.127564 -1.150514
H  2.679537 1.354744 0.406856
C  0.503952 1.444671 0.511421
C  -0.653613 1.103219 -0.313295
H  0.528773 -1.28962 -1.538805
H  -1.923998 -1.164912 -1.249196
H  0.363283 1.170667 1.560233
H  -0.541197 1.324252 -1.379392
H  -2.800597 1.013871 -0.490465
H  0.61822 2.545558 0.456769
H  -0.326943 -1.282509 1.419113
totalener: -311.15623162 hartree
nucrepener: 381.07291857 hartree
electener: -692.22915019 hartree
oneelecener: -1162.50492933 hartree
twoeener: 470.27577914 hartree
kineticenergy: 309.72158983 hartree
exchangeener: -12.754162143296 hartree
correlationener: -0.943965285275 hartree
xcener: -13.698127428571 hartree
chargesum: 1.0000000
charge: -0.229624 0.179660 -0.231318 0.183528 -0.124212 -0.146044 -0.243445 0.165920 0.181936 -0.248998 0.159126 0.183732 -0.236420 0.034391 0.205240 0.167924 0.174469 0.232030 0.187955 0.212282 0.191868
charge: 0.088789 0.006694 0.091480 0.000294 0.100394 0.079872 0.071010 -0.000907 0.005937 0.107370 -0.007046 0.000002 0.069768 0.338234 -0.011943 0.000517 0.004025 0.015035 0.009351 0.040881 -0.009755
qa: -0.2296 0.1797 -0.2313 0.1835 -0.1242 -0.1460 -0.2434 0.1659 0.1819 -0.2490 0.1591 0.1837 -0.2364 0.0344 0.2052 0.1679 0.1745 0.2320 0.1880 0.2123 0.1919
va: 3.8591 0.9797 3.9012 0.9740 3.8332 3.8418 3.9121 0.9845 0.9761 3.8849 0.9823 0.9715 3.9113 3.5820 0.9701 0.9850 0.9836 0.9561 0.9752 0.9645 0.9792
energy: -311.856377000299
dipole: 0.50993 -0.90497 -0.39504 1.92134 -1.04849 0.87285 0.14750 -0.28038 -0.13287
magnitude: 0.96726 au
magnitude: 2.45857 debye
