program: Orca
programVersion: 5.0.3
elementType: C H C H C C C H H C H H C C H H H H H H H
charge: 1
multiplicity: 1
keywords: DSD-PBEP86/2013 cc-pVTZ EnGrad D3BJ RIJCOSX verytightscf cc-pVTZ/C def2/J soscf
formula: C8H13
InChI: InChI=1/C8H13/c1-2-4-6-8-7-5-3-1/h1-2,7H,3-6,8H2
21 atoms
C  -2.002015 0.692051 0.073305
H  -2.176903 0.793325 1.148904
C  -1.755995 -0.964729 -0.171828
H  -2.629129 -1.390634 0.33021
C  -0.411312 -1.36731 0.377345
C  0.672143 -1.266096 -0.403939
C  1.981604 -0.707653 0.066896
H  2.175511 -0.932536 1.120903
H  2.844183 -1.037702 -0.520524
C  1.798047 0.83129 -0.122311
H  1.831856 1.092824 -1.185838
H  2.608153 1.376612 0.369344
C  0.440263 1.343423 0.49977
C  -0.749992 1.265796 -0.337563
H  0.515336 -1.195346 -1.484677
H  -1.833972 -1.141077 -1.247068
H  0.262431 0.917369 1.489202
H  -0.653406 1.624412 -1.36718
H  -2.865553 0.990806 -0.523064
H  0.567164 2.441941 0.631413
H  -0.315799 -1.439437 1.460443
totalener: -311.13232520 hartree
nucrepener: 379.13942952 hartree
electener: -690.27175472 hartree
oneelecener: -1158.70997643 hartree
twoeener: 468.43822172 hartree
kineticenergy: 309.72452676 hartree
exchangeener: -14.118185227409 hartree
correlationener: -0.942393129891 hartree
xcener: -15.060578357300 hartree
chargesum: 1.0000000
charge: -0.250689 0.195176 -0.237940 0.191485 -0.163351 -0.143357 -0.232384 0.159331 0.175189 -0.248491 0.157447 0.178670 -0.236439 0.099389 0.167024 0.181484 0.169373 0.240967 0.197211 0.212047 0.187856
charge: 0.121475 0.014284 0.147758 0.003252 0.034838 0.047374 0.070214 -0.003544 0.000172 0.111017 -0.010044 -0.001004 0.082922 0.336622 -0.018543 -0.001970 0.006000 0.023496 0.007731 0.050349 -0.022398
qa: -0.2507 0.1952 -0.2379 0.1915 -0.1634 -0.1434 -0.2324 0.1593 0.1752 -0.2485 0.1574 0.1787 -0.2364 0.0994 0.1670 0.1815 0.1694 0.2410 0.1972 0.2120 0.1879
va: 3.8709 0.9737 3.9073 0.9691 3.8182 3.8466 3.8996 0.9867 0.9774 3.8838 0.9835 0.9732 3.9167 3.5197 0.9826 0.9765 0.9900 0.9515 0.9754 0.9655 0.9801
dispcorr: -0.014122695 hartree
energy: -311.817608351476
dipole: 0.30891 -1.08598 -0.77708 1.96659 -0.63291 1.33368 0.20792 -0.35004 -0.14212
magnitude: 1.55008 au
magnitude: 3.93999 debye
