program: Gaussian 09
title: 000050910
version: EM64L-G09RevD.01
frameworkgroup: C1[X(C20H22N2O3)]
method: RPBEPBE
basis: SDD
operation: Freq
keyword: #p
keyword: freq=noraman
keyword: PBEPBE/SDD
title: #p freq=noraman PBEPBE/SDD
converged: YES YES NO NO
title: Mulliken charges:
elementType: O O O N N C C C C C C C C C C C C C C C C C C C C H H H H H H H H H H H H H H H H H H H H H H
charge: -0.189294 -0.183290 -0.280883 -0.312547 -0.132989 -0.270835 -0.271119 -0.248170 -0.241227 -0.531352 -0.217566 -0.218683 0.109389 0.103093 0.498289 -0.352883 -0.363786 -0.385689 -0.344343 0.282935 0.128816 -0.334007 -0.396147 -0.673230 -0.652909 0.292766 0.290881 0.274955 0.279167 0.236967 0.261418 0.248511 0.248842 0.273874 0.269990 0.267464 0.243059 0.255203 0.198771 0.230312 0.256150 0.261545 0.213336 0.212999 0.222686 0.218131 0.221403
chargesum: 0.00000
title: Mulliken charges with hydrogens summed into heavy atoms:
elementType: O O O N N C C C C C C C C C C C C C C C C C C C C
charge: -0.189294 -0.183290 -0.280883 -0.312547 -0.132989 0.021930 0.019762 0.026785 0.037940 -0.032968 0.030945 0.030159 0.109389 0.103093 0.498289 -0.079008 -0.093796 -0.118226 -0.101284 0.282935 0.128816 0.119967 0.090315 0.014649 0.009311
polarizability: 3.48219932e+02 -3.97335698e-01 2.24659524e+02 4.36081093e+00 3.41900993e+00 1.50332283e+02
1716.lowfreq: -6.9033 -0.0003 0.0005 0.0006 4.2732 6.7210 22.5357 29.6429 39.1615
frequency: 22.1492 29.4640 39.1558 54.1427 65.5577 80.2957 84.7294 100.6028 119.2078 140.9587 145.3476 164.0440 195.8773 204.0082 212.7642 218.9388 241.4237 277.2356 309.9326 318.3652 348.7790 382.1403 394.5522 398.7691 411.7061 420.9615 435.7367 484.0402 495.2255 516.8054 520.8942 555.9130 597.0539 617.6234 627.9219 630.9660 673.2827 682.5685 700.4042 721.6579 747.1788 755.4343 771.3738 773.7716 785.0720 787.9145 803.6063 836.4733 845.8655 863.7138 865.7946 898.6388 900.6087 915.5977 929.3020 937.8306 940.1891 960.3754 962.4040 973.2733 999.0817 1003.8388 1008.7225 1020.4818 1025.2993 1031.1796 1071.8084 1086.0071 1090.0847 1090.2101 1097.2499 1103.5311 1126.3085 1127.4279 1142.2722 1148.5704 1169.1953 1190.7600 1203.5572 1213.4283 1218.5952 1222.3737 1239.5270 1262.4130 1266.7295 1273.6001 1275.5975 1281.7997 1307.8741 1313.7295 1315.0314 1322.2316 1346.5294 1359.3256 1371.5202 1381.2784 1393.3534 1405.9426 1413.3616 1452.0671 1466.0755 1469.2962 1476.3548 1483.3952 1487.3169 1488.8734 1504.9217 1545.1124 1577.8001 1579.4554 1616.3285 1625.5459 1684.9528 2965.3345 2986.5856 2988.4349 3002.0963 3021.2982 3059.9821 3062.4161 3072.1360 3074.2184 3082.7893 3086.3277 3095.5769 3101.0651 3102.7988 3105.3267 3110.4040 3148.5784 3158.6276 3162.4510 3188.7810 3193.6013 3194.3262
redmass: 4.8718 4.7729 4.9485 4.5266 3.8430 2.7188 4.9899 4.0715 6.3021 4.3105 3.7213 3.7983 4.1159 1.9641 1.6241 1.5346 3.8904 3.8693 2.7929 4.5552 4.0983 4.0141 4.6770 3.3212 2.8573 4.2967 4.0485 2.2689 3.8725 4.2049 4.0940 3.2621 7.8823 4.6468 4.3826 5.5627 4.2027 5.3123 5.3299 1.8149 4.6500 3.9190 1.3673 3.7049 2.1336 1.8113 4.3361 1.3334 1.7710 2.3734 2.8563 2.5823 2.3426 2.0637 1.5052 4.2219 1.9805 1.8701 2.0625 1.3862 1.7625 1.7139 3.2871 2.4621 1.6191 4.2166 2.3040 1.9099 1.9015 1.2986 1.1229 1.7411 1.8428 1.6467 2.6543 1.8007 3.4382 2.1523 1.3432 2.5769 1.3388 1.2522 1.5954 1.3291 1.7643 1.5403 1.4467 1.6461 1.3892 1.3022 1.7497 6.2650 1.2431 1.3373 6.6351 1.2360 1.2216 2.3118 3.2630 1.1605 1.0469 1.0611 1.0660 1.1013 1.0803 1.0661 2.5878 5.9685 5.7226 7.2409 6.2205 12.1605 12.5790 1.0707 1.0357 1.0357 1.0592 1.0623 1.1029 1.0856 1.0947 1.0872 1.0992 1.0985 1.0982 1.1020 1.0895 1.1014 1.0943 1.0894 1.0905 1.0876 1.0946 1.0955 1.1098
irintensity: 1.6186 0.2869 1.2891 0.0267 1.7602 0.5715 0.4866 0.8864 3.8752 1.4494 4.4716 2.5407 1.5874 0.3104 0.2470 1.3418 0.9952 1.9045 4.9775 2.8237 15.9489 2.2343 4.7363 15.5466 0.9405 1.3947 8.3528 4.1090 8.0187 0.8646 2.9263 9.6848 7.5079 9.7199 5.2953 1.8981 0.1801 7.1402 23.9174 54.3551 5.2823 13.4508 19.3158 21.5305 7.0396 13.5269 0.6176 9.2416 23.5703 36.8986 18.5130 4.2267 4.9209 0.9847 1.2118 10.8578 5.8547 4.3964 3.0178 2.0547 0.3185 1.0865 4.5333 3.8996 20.0693 17.9720 8.4125 72.8210 4.9350 7.8477 1.5159 10.3798 13.4477 9.5517 130.8066 24.3236 87.5067 20.1099 20.2210 14.6541 3.9559 1.1361 0.0886 0.6961 0.6482 0.9955 123.5255 4.8398 52.8959 5.4027 12.4412 383.6499 17.9597 30.8767 0.4431 32.9392 36.3258 131.5649 41.6614 31.4385 9.0033 26.8965 3.3667 11.2650 16.6370 10.0418 32.2441 191.6971 4.2117 3.1079 28.3371 447.6684 11.1918 43.9594 15.8633 39.2116 41.8470 31.5986 6.7152 2.7852 3.5661 10.0442 52.9493 43.5479 42.3841 27.0694 24.0646 29.3348 8.7349 9.5639 1.5911 3.7325 1.3921 0.6727 20.8703
temp: 298.150 k
press: 1.00000 atm
elementType: 8 8 8 7 7 6 6 6 6 6 6 6 6 6 6 6 6 6 6 6 6 6 6 6 6 1 1 1 1 1 1 1 1 1 1 1 1 1 1 1 1 1 1 1 1 1 1
symmnumber: 1
zpe: 1000294.0 jmol-1
zpe.correction: 0.380992 hartree
zpe.thermalcorrener: 0.403319 hartree
zpe.thermalcorrenthalpy: 0.404264 hartree
zpe.thermalcorrgfe: 0.328198 hartree
zpe.sumelectzpe: -1108.692011 hartree
zpe.sumelectthermal: -1108.669684 hartree
zpe.sumelectthermalent: -1108.668740 hartree
zpe.sumelectthermalfe: -1108.744805 hartree
dipole: -2.0762 4.0184 -1.0276
dipole: 4.6384
quadrupole: -113.7143 -161.4729 -144.5714
quadrupole: 14.7691 -3.4791 6.4434
quadrupole: 26.2052 -21.5533 -4.6519 14.7691 -3.4791 6.4434
hfenergy: -1109.0730033 hartree
pointgroup: C01 [X(C20H22N2O3)]
dipole: -0.8716333 1.5207008 -0.5078638 debye
polarizability: 348.224543|3.3755512|224.8317975|0.0297369|-2.3919521|150.1553993 unknown
InChI: InChI=1S/C20H22N2O3/c1-3-21(4-2)18(23)12-7-9-15(10-8-12)22-19(24)16-13-5-6-14(11-13)17(16)20(22)25/h5-10,13-14,16-17H,3-4,11H2,1-2H3
charge 0 multiplicity 1
47 atoms
O  -1.816738 2.024953 -1.027382
O  -2.20858 -2.574082 -0.052107
O  4.544418 -1.903166 0.336467
N  -1.649693 -0.300017 -0.515593
N  4.977695 0.253675 -0.414557
C  -3.854788 0.626704 -0.788243
C  -3.98384 -0.89019 -0.470929
C  -4.609702 1.317539 0.430601
C  -4.796271 -0.910218 0.8967
C  -4.210298 0.357623 1.596102
C  -6.086074 0.933473 0.254622
C  -6.197811 -0.398291 0.534047
C  -2.355896 0.916238 -0.804506
C  -2.552969 -1.400451 -0.318723
C  -0.213931 -0.399974 -0.420373
C  0.449897 -1.570752 -0.866861
C  0.533605 0.669262 0.132093
C  1.850404 -1.659963 -0.763028
C  1.936961 0.575532 0.206234
C  2.61566 -0.582354 -0.251107
C  4.104077 -0.785255 -0.097177
C  6.42093 0.013373 -0.139907
C  4.636534 1.438547 -1.237169
C  6.788545 0.198418 1.346723
C  4.864539 2.783249 -0.514982
H  -4.291503 0.939932 -1.749744
H  -4.498628 -1.48354 -1.24325
H  -4.379349 2.386682 0.537941
H  -4.733003 -1.869676 1.428327
H  -3.123791 0.304947 1.789886
H  -4.737691 0.597452 2.532843
H  -6.864099 1.606552 -0.11423
H  -7.085319 -1.028914 0.439245
H  -0.124697 -2.408555 -1.266292
H  0.026492 1.568124 0.48814
H  2.368926 -2.574522 -1.066974
H  2.500985 1.399844 0.654671
H  6.660689 -1.021627 -0.445426
H  7.000817 0.708409 -0.77411
H  5.258996 1.40967 -2.155942
H  3.587829 1.354656 -1.562551
H  6.221834 -0.516115 1.966547
H  6.567885 1.223766 1.693059
H  7.866641 0.004399 1.497972
H  5.919097 2.903327 -0.209048
H  4.23719 2.863671 0.390453
H  4.609225 3.621546 -1.188762
