program: Gaussian 09
title: 000050781
version: EM64L-G09RevD.01
frameworkgroup: C1[X(C15H24N2O2)]
method: RPBEPBE
basis: SDD
operation: Freq
keyword: #p
keyword: freq=noraman
keyword: PBEPBE/SDD
title: #p freq=noraman PBEPBE/SDD
converged: YES YES NO NO
title: Mulliken charges:
elementType: O O N N C C C C C C C C C C C C C C C H H H H H H H H H H H H H H H H H H H H H H H H
charge: -0.321255 -0.266139 -0.347995 -0.684689 0.284475 -0.358698 -0.058029 -0.306518 -0.725421 -0.727624 -0.694042 -0.706255 0.195168 0.225527 -0.336445 -0.325210 -0.408280 -0.401907 0.501447 0.259017 0.182387 0.196501 0.184488 0.247032 0.216294 0.210285 0.235114 0.214309 0.219737 0.208656 0.230961 0.194111 0.204079 0.247125 0.204199 0.215232 0.208918 0.265795 0.254068 0.221773 0.219424 0.310824 0.311562
chargesum: 0.00000
title: Mulliken charges with hydrogens summed into heavy atoms:
elementType: O O N N C C C C C C C C C C C C C C C
charge: -0.321255 -0.266139 -0.088978 -0.062303 0.284475 0.020190 0.126459 0.156807 -0.065713 -0.068270 -0.048727 -0.077906 0.195168 0.225527 -0.070650 -0.071141 -0.186507 -0.182484 0.501447
polarizability: 2.48910529e+02 3.23720403e+01 1.96774820e+02 -5.29677186e+00 2.21354917e+01 1.40263018e+02
1716.lowfreq: -7.9958 -1.3417 -0.0007 -0.0003 0.0003 8.1042 16.7425 20.1335 31.1465
frequency: 16.6847 18.7087 31.1061 48.4124 62.3810 69.2508 97.5713 113.5831 137.3328 166.5041 179.0852 192.5438 217.6158 223.8659 232.0999 243.6762 255.2479 263.7275 290.3797 311.8970 353.2994 364.5013 369.7132 380.3999 411.2028 415.3026 416.2961 424.4132 438.7571 468.6303 508.2843 511.8430 552.4273 607.4375 633.7316 672.5234 678.7458 747.2784 754.7091 800.1656 824.8545 825.1995 830.3365 843.7874 881.3976 901.7449 914.5718 918.2402 922.2832 938.7789 949.3684 966.2136 971.4973 984.7001 985.6127 997.5452 1013.9917 1017.9772 1054.2019 1107.7327 1129.0101 1130.9050 1138.1671 1161.8218 1179.6991 1181.7543 1212.0036 1241.5129 1250.9178 1254.4324 1269.8720 1300.8462 1308.7106 1325.3388 1334.5685 1349.4820 1362.4979 1367.8858 1371.8247 1389.0206 1391.5526 1391.7471 1448.0176 1450.6585 1453.0007 1460.8640 1463.3783 1468.1108 1473.0246 1477.3850 1480.5467 1484.5678 1490.3353 1494.6374 1517.2119 1570.3452 1613.7101 1632.0206 1647.2252 2858.3963 2944.6951 2965.7449 2969.6280 2978.5106 2985.2522 3006.4130 3010.8537 3056.1164 3062.9652 3069.0861 3070.6737 3078.3537 3084.1367 3086.8424 3087.4526 3093.2153 3123.3285 3126.4323 3158.4613 3171.0119 3426.3469 3560.7217 3700.4066
redmass: 4.2810 3.8815 2.6684 3.7004 3.6710 3.9672 5.4781 3.2744 2.3783 2.1197 3.5416 1.0567 3.2962 1.3689 1.3810 1.2498 1.7445 3.9847 4.8064 2.3402 4.2823 2.3499 2.6600 2.3508 1.2761 1.3852 1.6069 2.1300 3.0691 2.6501 2.8869 3.3495 3.8340 5.9212 6.8799 1.9383 2.4933 3.8368 4.4187 4.4753 1.4358 2.1717 5.5376 1.8259 1.9429 2.9986 1.3971 1.2549 1.4101 2.2624 1.5556 1.7055 1.3621 1.3521 1.5184 3.2387 1.4492 1.4764 4.5371 2.7003 1.8170 1.2537 2.2783 1.8873 1.1515 1.7556 2.1392 1.3853 2.6643 2.5941 1.6502 1.3618 1.3196 2.8867 1.4303 1.4800 1.4569 1.2189 1.2339 1.2219 1.2202 4.7591 3.9064 1.0994 1.1632 1.0593 1.0541 1.0524 1.0719 1.0479 1.0695 1.0912 1.0567 1.0714 3.1895 7.2780 10.3277 3.3041 1.4262 1.0704 1.0823 1.0355 1.0366 1.0350 1.0361 1.0864 1.0577 1.0991 1.0987 1.0990 1.0990 1.1013 1.1035 1.1009 1.0991 1.1004 1.0895 1.0891 1.0953 1.0948 1.0735 1.0451 1.1040
irintensity: 1.2396 0.2050 0.0983 1.2498 1.0900 1.1745 0.5896 1.3765 3.4413 0.4597 0.8679 0.0923 1.8627 1.3351 1.6482 2.2231 0.1340 4.2421 6.7254 6.0333 0.3867 1.1884 2.2817 3.4114 9.9923 255.2233 48.1780 1.8992 7.4975 0.6915 3.5976 3.2642 6.5949 11.2623 2.5384 24.7052 85.6175 4.2456 13.9910 10.5641 1.7108 1.3206 4.1210 70.6701 0.9775 11.1463 3.9510 6.3604 8.7534 37.2834 11.7294 7.1277 0.1184 0.3384 3.1224 44.9619 15.9275 13.5343 429.8894 8.5982 18.4071 20.1267 1.9188 32.2588 194.0705 10.5558 11.7672 58.0284 234.2877 114.6660 24.5852 1.2567 1.9147 100.3981 1.4534 36.2990 10.5255 26.9973 28.8585 12.2663 18.1702 11.0374 6.0901 10.9755 42.7387 2.0528 4.5139 0.7297 23.6809 16.9281 1.9167 5.0231 19.4806 10.6813 69.0277 27.4109 361.0957 94.0033 313.5335 96.2364 21.3746 36.9047 41.0787 25.2518 19.5755 31.1546 34.8659 16.5712 72.4870 62.0901 13.4813 25.5421 40.4587 46.7910 18.5815 43.5890 14.7647 21.4697 10.4474 4.8574 3.2935 111.1295 23.2558
temp: 298.150 k
press: 1.00000 atm
elementType: 8 8 7 7 6 6 6 6 6 6 6 6 6 6 6 6 6 6 6 1 1 1 1 1 1 1 1 1 1 1 1 1 1 1 1 1 1 1 1 1 1 1 1
symmnumber: 1
zpe: 962246.3 jmol-1
zpe.correction: 0.366500 hartree
zpe.thermalcorrener: 0.388034 hartree
zpe.thermalcorrenthalpy: 0.388978 hartree
zpe.thermalcorrgfe: 0.314192 hartree
zpe.sumelectzpe: -844.483943 hartree
zpe.sumelectthermal: -844.462409 hartree
zpe.sumelectthermalent: -844.461465 hartree
zpe.sumelectthermalfe: -844.536251 hartree
dipole: 2.7238 3.8749 2.3506
dipole: 5.2876
quadrupole: -83.5541 -112.8185 -120.2420
quadrupole: 19.7019 -0.3256 0.4751
quadrupole: 21.9841 -7.2803 -14.7037 19.7019 -0.3256 0.4751
hfenergy: -844.8504432 hartree
pointgroup: C01 [X(C15H24N2O2)]
dipole: -1.031837 -1.5208864 0.9746373 debye
polarizability: 247.0098736|34.0624533|197.0361744|5.1232103|-23.8334757|141.902319 unknown
InChI: InChI=1S/C15H24N2O2/c1-11(2)9-17-15(3,4)10-19-14(18)12-5-7-13(16)8-6-12/h5-8,11,17H,9-10,16H2,1-4H3
charge 0 multiplicity 1
43 atoms
O  -0.03374 1.043286 0.040418
O  -1.406424 2.415582 -1.253554
N  2.611027 0.104243 -0.060233
N  -5.448562 -2.383903 0.494105
C  2.330398 1.447677 0.526053
C  3.732009 -0.691795 0.47926
C  3.981269 -1.956461 -0.383672
C  1.088366 1.989342 -0.210968
C  3.50006 2.414048 0.209499
C  2.066898 1.414208 2.062235
C  4.448319 -1.582346 -1.808121
C  4.994261 -2.892088 0.315809
C  -1.263748 1.377018 -0.55644
C  -2.318037 0.382549 -0.260842
C  -3.608385 0.573801 -0.826948
C  -2.097035 -0.753015 0.56567
C  -4.646198 -0.335545 -0.582347
C  -3.128559 -1.669285 0.818892
C  -4.423747 -1.47741 0.247268
H  1.742239 -0.44874 -0.096374
H  3.57656 -1.014111 1.539502
H  4.650705 -0.072751 0.465468
H  3.013245 -2.498524 -0.46853
H  1.268922 2.038613 -1.299326
H  0.798327 2.989592 0.158054
H  3.243463 3.449495 0.499886
H  3.733397 2.390396 -0.869486
H  4.410748 2.130733 0.766196
H  2.941778 1.002542 2.597228
H  1.878859 2.430512 2.45674
H  1.187286 0.787373 2.292355
H  5.457872 -1.127037 -1.776798
H  4.499186 -2.473541 -2.46127
H  3.755362 -0.849268 -2.25608
H  5.968518 -2.382364 0.448676
H  5.172697 -3.802999 -0.28485
H  4.636475 -3.205926 1.314942
H  -3.77151 1.451822 -1.461012
H  -1.108245 -0.9041 1.008168
H  -5.635239 -0.173992 -1.027803
H  -2.944407 -2.540115 1.459842
H  -5.295466 -3.198163 1.082325
H  -6.371546 -2.250053 0.090764
