program: Orca
programVersion: 5.0.3
elementType: C H C H C C C H H C H H C C H H H H H H H
charge: 1
multiplicity: 1
keywords: b3lyp cc-pVTZ EnGrad D3BJ RIJCOSX verytightscf cc-pVTZ/C def2/J soscf
formula: C8H13
InChI: InChI=1/C8H13/c1-3-7-5-2-6-8(4-1)9-7/h3,6-8H,1-2,4-5H2
21 atoms
C  -2.00137 0.678914 0.097663
H  -2.205087 0.869693 1.155688
C  -1.814405 -0.925746 -0.134071
H  -2.636601 -1.42892 0.377731
C  -0.44781 -1.334518 0.401867
C  0.693397 -1.274511 -0.363935
C  2.005003 -0.67604 0.087181
H  2.21253 -0.877538 1.142527
H  2.852788 -1.012079 -0.512527
C  1.819861 0.923602 -0.133618
H  1.895101 1.145136 -1.203005
H  2.636159 1.432341 0.382283
C  0.446194 1.314865 0.406477
C  -0.700249 1.292073 -0.356066
H  0.537235 -1.225912 -1.445689
H  -1.89205 -1.137159 -1.205219
H  0.004467 0.003055 0.193935
H  -0.555379 1.280034 -1.440151
H  -2.855995 1.009151 -0.495378
H  0.343455 1.362371 1.493661
H  -0.344434 -1.408721 1.48727
totalener: -312.18361817 hartree
nucrepener: 382.79968132 hartree
electener: -694.98329949 hartree
oneelecener: -1166.12703082 hartree
twoeener: 471.14373133 hartree
kineticenergy: 309.94722405 hartree
exchangeener: -36.295930056718 hartree
correlationener: -2.309211483334 hartree
xcener: -38.605141540051 hartree
chargesum: 1.0000000
charge: -0.193630 0.145204 -0.203557 0.158181 -0.051995 -0.022059 -0.192766 0.144151 0.159095 -0.202382 0.142090 0.157758 -0.052226 -0.021753 0.154422 0.142766 0.099703 0.156583 0.159459 0.159908 0.161048
charge: 0.111293 -0.004136 0.117528 0.000118 0.125262 0.155126 0.110624 -0.004305 0.001200 0.117534 -0.005463 -0.000127 0.124351 0.159680 0.001219 -0.005367 -0.011192 0.000718 0.001351 0.003158 0.001428
qa: -0.1936 0.1452 -0.2036 0.1582 -0.0520 -0.0221 -0.1928 0.1442 0.1591 -0.2024 0.1421 0.1578 -0.0522 -0.0218 0.1544 0.1428 0.0997 0.1566 0.1595 0.1599 0.1610
va: 3.8443 0.9882 3.8619 0.9816 3.7637 3.7621 3.8443 0.9887 0.9806 3.8621 0.9893 0.9818 3.7657 3.7599 0.9935 0.9889 1.1052 0.9921 0.9806 0.9943 0.9933
dispcorr: -0.036968054 hartree
energy: -312.220586222489
dipole: -0.00728 -0.00721 -0.01449 0.01128 -0.00209 0.00919 -0.06424 0.04622 -0.01802
magnitude: 0.02488 au
magnitude: 0.06325 debye
