program: Orca
programVersion: 5.0.3
elementType: C H C H C C C H H C H H C C H H H H H H H
charge: 1
multiplicity: 1
keywords: m062x cc-pVTZ EnGrad RIJCOSX verytightscf cc-pVTZ/C def2/J soscf
formula: C8H13
InChI: InChI=1/C8H13/c1-2-4-6-8-7-5-3-1/h1-2,7H,3-6,8H2
21 atoms
C  -2.002804 0.70954 0.072017
H  -2.175679 0.796196 1.148561
C  -1.747209 -0.969852 -0.171016
H  -2.626102 -1.375045 0.337199
C  -0.410348 -1.373647 0.380127
C  0.674678 -1.267505 -0.399572
C  1.986052 -0.706796 0.065681
H  2.182502 -0.92846 1.119956
H  2.847111 -1.03845 -0.522508
C  1.794562 0.831305 -0.124794
H  1.827905 1.09374 -1.188121
H  2.60313 1.378652 0.367074
C  0.43603 1.331021 0.498964
C  -0.756126 1.274329 -0.341632
H  0.514934 -1.190703 -1.479599
H  -1.830908 -1.140468 -1.246178
H  0.252192 0.883196 1.477837
H  -0.656344 1.63153 -1.371179
H  -2.870792 0.992593 -0.524369
H  0.55422 2.42617 0.663402
H  -0.317628 -1.44888 1.463053
totalener: -312.27619546 hartree
nucrepener: 379.06585541 hartree
electener: -691.34205086 hartree
oneelecener: -1158.90994193 hartree
twoeener: 467.56789107 hartree
kineticenergy: 310.02483996 hartree
xcener: -23.082279791580 hartree
chargesum: 1.0000000
charge: -0.322092 0.224351 -0.282665 0.203120 -0.166862 -0.132571 -0.299988 0.182969 0.184950 -0.281641 0.181711 0.189035 -0.279076 0.108511 0.185702 0.204305 0.189072 0.267572 0.203671 0.231484 0.208443
charge: 0.122855 0.014817 0.155539 0.004459 0.026847 0.049572 0.069084 -0.002075 0.000588 0.108160 -0.008916 0.000436 0.080791 0.326232 -0.016754 -0.000914 0.006766 0.024710 0.007495 0.051539 -0.021231
qa: -0.3221 0.2244 -0.2827 0.2031 -0.1669 -0.1326 -0.3000 0.1830 0.1850 -0.2816 0.1817 0.1890 -0.2791 0.1085 0.1857 0.2043 0.1891 0.2676 0.2037 0.2315 0.2084
va: 3.7392 0.9426 3.7689 0.9507 3.6195 3.6540 3.7753 0.9609 0.9598 3.7277 0.9560 0.9533 3.7530 3.3286 0.9574 0.9502 0.9661 0.9192 0.9603 0.9432 0.9524
energy: -312.276195455496
dipole: 0.28519 -1.07682 -0.79163 1.94750 -0.62859 1.31891 0.22951 -0.37659 -0.14708
magnitude: 1.54526 au
magnitude: 3.92775 debye
