program: Gaussian 09
title: 000050775
version: EM64L-G09RevD.01
frameworkgroup: C1[X(C15H22N2O2)]
method: RPBEPBE
basis: SDD
operation: Freq
keyword: #p
keyword: freq=noraman
keyword: PBEPBE/SDD
title: #p freq=noraman PBEPBE/SDD
converged: YES YES NO NO
title: Mulliken charges:
elementType: O O N N C C C C C C C C C C C C C C C H H H H H H H H H H H H H H H H H H H H H H
charge: -0.306030 -0.275392 -0.328216 -0.685049 -0.031594 -0.476602 -0.445282 -0.424011 -0.432337 -0.397361 0.030823 -0.711860 0.173514 0.222351 -0.336765 -0.329661 -0.407373 -0.401059 0.499702 0.193096 0.209511 0.209836 0.216362 0.208526 0.206806 0.214958 0.215883 0.205772 0.247778 0.233834 0.210872 0.220273 0.240417 0.214540 0.222355 0.265048 0.266201 0.220459 0.219039 0.310172 0.310459
chargesum: 0.00000
title: Mulliken charges with hydrogens summed into heavy atoms:
elementType: O O N N C C C C C C C C C C C C C C C
charge: -0.306030 -0.275392 -0.080438 -0.064417 0.161502 -0.057255 -0.020393 -0.002246 -0.010682 0.047346 0.251097 -0.034548 0.173514 0.222351 -0.071717 -0.063460 -0.186914 -0.182020 0.499702
polarizability: 2.80654109e+02 -2.61256480e+01 1.35001586e+02 -1.89819465e+01 -1.04616600e+01 1.65982907e+02
1716.lowfreq: -15.9789 -0.0007 -0.0001 0.0004 2.0352 7.3685 8.4979 19.7945 25.8913
frequency: -15.0779 19.7758 24.7778 30.7008 53.3435 76.2382 82.9298 99.0710 112.8276 144.8014 167.3980 196.4764 220.4226 249.0110 267.8446 284.2178 334.3495 359.5626 382.8803 404.6942 408.7367 410.7962 416.7938 452.6513 467.7155 506.7297 517.5939 579.7687 614.3957 619.3911 634.4957 676.6394 711.1332 754.8305 756.3189 776.5749 811.1104 820.2036 824.7365 837.7078 843.3599 864.3870 893.6161 909.1914 929.4386 950.2557 969.4874 973.0746 974.5275 983.9808 997.4324 1016.6032 1027.7094 1049.7123 1058.6769 1072.1037 1092.1326 1129.9050 1145.2114 1153.7967 1165.1862 1169.3507 1177.4994 1180.5627 1209.2096 1226.8995 1237.7587 1252.2851 1269.3201 1275.8406 1292.5947 1298.5001 1307.1417 1309.1271 1323.6091 1327.8213 1338.4152 1353.7327 1374.7922 1386.8858 1391.8090 1447.6357 1460.7338 1464.1395 1465.7347 1472.4421 1473.0923 1473.7464 1484.8548 1491.6779 1517.1323 1569.7545 1606.7301 1631.5637 1645.2325 2841.7442 2908.1377 2985.8475 2991.5445 2991.9432 2995.6832 3007.3344 3012.6068 3038.5204 3040.8358 3053.4097 3060.9810 3079.4273 3092.4893 3101.7635 3122.4388 3125.3268 3158.2181 3174.1341 3408.4669 3560.7893 3700.7227
redmass: 1.7309 4.2771 3.5246 3.2003 3.4689 4.9433 3.0767 4.7705 5.1322 3.4128 2.3371 1.6778 1.7964 3.7780 3.7142 4.4673 4.2179 4.3657 3.1693 2.5984 1.1986 1.2011 2.2440 2.1401 3.7010 2.9885 3.0253 4.3780 5.5267 2.8341 6.8918 4.0618 1.3493 4.3722 1.2177 5.9321 1.5259 4.1618 1.2628 4.0716 1.8548 3.3626 2.4358 2.4965 1.3894 1.5495 1.3999 1.6371 1.3582 1.3488 3.2942 1.4837 2.7004 3.3246 2.6699 2.5061 1.9581 1.2144 3.1635 2.0665 1.6162 1.4629 1.5728 1.1721 1.4963 1.2706 1.2244 2.6160 1.3146 1.2083 1.2389 1.3456 1.3342 1.3081 2.0284 1.8700 1.5312 1.4736 1.3776 1.3091 4.7779 4.2717 1.2370 1.0729 1.0594 1.0721 1.0859 1.0752 1.0792 1.0987 3.2074 7.3507 9.8004 3.0515 1.4779 1.0817 1.0694 1.0583 1.0400 1.0543 1.0626 1.0844 1.0662 1.0983 1.0936 1.1021 1.1037 1.1048 1.0996 1.1001 1.0896 1.0893 1.0953 1.0947 1.0737 1.0450 1.1040
irintensity: 0.0681 0.4993 2.1848 0.4219 1.2568 1.0276 0.3548 1.4866 0.6662 2.4086 1.0454 1.8462 1.1744 1.5592 2.2080 8.8885 3.7131 3.5629 1.0906 39.9485 178.8305 114.0617 0.5887 9.5035 2.1570 5.6071 1.7702 7.9198 8.9464 1.5658 1.8137 28.0034 69.5553 14.6105 4.8380 16.6225 1.9180 2.0976 0.3778 7.9309 70.9427 2.3597 5.4259 4.9849 0.7895 6.6019 6.6484 2.5309 0.1569 0.1427 42.8785 10.9325 10.7587 437.1747 52.6452 4.9779 35.2621 15.1078 94.1323 6.3420 10.9615 8.1978 37.3173 134.4911 1.8760 2.2242 1.1471 340.1425 1.5027 2.2437 4.6330 2.9192 7.6841 3.1884 45.4896 67.9842 57.7203 21.9536 18.4703 19.6083 12.0659 7.1348 10.2922 1.0616 15.3320 5.1761 13.8524 14.8273 7.8854 2.9043 73.6117 40.8793 323.3991 95.7712 345.6731 79.0095 78.8187 20.4332 11.0267 52.9773 57.5726 11.4668 52.5599 7.7834 40.9775 6.1318 15.0436 107.9303 34.1961 20.6592 16.2361 23.3096 9.3896 3.6719 1.1012 112.6518 22.9185
temp: 298.150 k
press: 1.00000 atm
elementType: 8 8 7 7 6 6 6 6 6 6 6 6 6 6 6 6 6 6 6 1 1 1 1 1 1 1 1 1 1 1 1 1 1 1 1 1 1 1 1 1 1
symmnumber: 1
zpe: 913165.9 jmol-1
zpe.correction: 0.347807 hartree
zpe.thermalcorrener: 0.366583 hartree
zpe.thermalcorrenthalpy: 0.367528 hartree
zpe.thermalcorrgfe: 0.298328 hartree
zpe.sumelectzpe: -843.307139 hartree
zpe.sumelectthermal: -843.288362 hartree
zpe.sumelectthermalent: -843.287418 hartree
zpe.sumelectthermalfe: -843.356618 hartree
dipole: 3.2913 -1.2338 -2.2677
dipole: 4.1830
quadrupole: -69.1052 -114.5749 -112.9489
quadrupole: -7.7126 -9.9400 -1.6484
quadrupole: 29.7712 -15.6986 -14.0726 -7.7126 -9.9400 -1.6484
hfenergy: -843.6549458 hartree
pointgroup: C01 [X(C15H22N2O2)]
dipole: -1.3062337 0.9093315 -0.4187089 debye
polarizability: 281.89102|-29.1337025|135.5885605|0.8965793|-13.2845868|164.1590212 unknown
InChI: InChI=1S/C15H22N2O2/c1-11(10-17-14-4-2-3-5-14)19-15(18)12-6-8-13(16)9-7-12/h6-9,11,14,17H,2-5,10,16H2,1H3
charge 0 multiplicity 1
41 atoms
O  -0.636669 -0.699964 -0.794462
O  -0.976249 -1.280585 1.447288
N  3.005051 -0.573254 0.170577
N  -6.728894 1.247833 -0.258772
C  4.010077 0.454218 0.52964
C  5.354868 -0.183593 0.954135
C  4.428933 1.353449 -0.662515
C  6.394803 0.965701 0.823933
C  5.793791 1.963178 -0.229458
C  1.649805 -0.057769 -0.128455
C  0.773471 -1.196455 -0.697379
C  1.177564 -1.636554 -2.102521
C  -1.417127 -0.789837 0.372003
C  -2.782483 -0.256487 0.170313
C  -3.688725 -0.274419 1.265707
C  -3.222994 0.274873 -1.072736
C  -4.993011 0.220748 1.131332
C  -4.526338 0.772571 -1.219022
C  -5.436204 0.754606 -0.117744
H  3.649178 1.116033 1.359634
H  5.579802 -1.001871 0.242539
H  5.324184 -0.617003 1.971278
H  3.683653 2.130598 -0.909469
H  4.54588 0.700285 -1.548931
H  7.38249 0.580633 0.513997
H  6.53833 1.472532 1.795936
H  5.648121 2.960037 0.226039
H  6.463421 2.102573 -1.096722
H  2.957724 -1.302111 0.898862
H  1.138744 0.376355 0.762607
H  1.734973 0.740933 -0.887869
H  0.77738 -2.045086 0.014817
H  2.251807 -1.890026 -2.096953
H  1.012907 -0.817685 -2.825588
H  0.595735 -2.515259 -2.429627
H  -3.341967 -0.68526 2.219953
H  -2.528614 0.289058 -1.917486
H  -5.679975 0.200261 1.986079
H  -4.853551 1.178687 -2.183987
H  -7.048812 1.627153 -1.145418
H  -7.37978 1.235903 0.521345
