program: Orca
programVersion: 5.0.3
elementType: C H C H C C C H H C H H C C H H H H H H H
charge: 1
multiplicity: 1
keywords: m062x cc-pVTZ EnGrad RIJCOSX verytightscf cc-pVTZ/C def2/J soscf
formula: C8H13
InChI: InChI=1/C8H13/c1-2-4-6-8-7-5-3-1/h1-2,7H,3-6,8H2
21 atoms
C  -1.996704 0.532596 0.120007
H  -2.173758 0.723856 1.18198
C  -1.946693 -0.994356 -0.171541
H  -2.674962 -1.584656 0.387249
C  -0.512365 -1.154205 0.285966
C  0.613024 -1.133165 -0.500426
C  1.908489 -0.655441 0.066457
H  2.012124 -0.951945 1.115629
H  2.766164 -1.043977 -0.48953
C  1.888343 0.908652 -0.040395
H  2.005624 1.197804 -1.091488
H  2.737528 1.33018 0.50399
C  0.553603 1.481539 0.492915
C  -0.557641 0.851109 -0.269131
H  0.532133 -1.303606 -1.573597
H  -2.05699 -1.200573 -1.240358
H  0.434758 1.348633 1.572998
H  -0.427801 0.913687 -1.352502
H  -2.725754 1.091561 -0.475827
H  0.535185 2.565455 0.291178
H  -0.363521 -1.103872 1.365964
totalener: -312.31175325 hartree
nucrepener: 385.01024815 hartree
electener: -697.32200140 hartree
oneelecener: -1170.61538638 hartree
twoeener: 473.29338498 hartree
kineticenergy: 310.03083530 hartree
xcener: -23.099606498950 hartree
chargesum: 1.0000000
charge: -0.252071 0.190836 -0.278162 0.188878 -0.085946 -0.056228 -0.313409 0.189850 0.190884 -0.269762 0.181592 0.191213 -0.302734 -0.059829 0.235345 0.187593 0.196359 0.238232 0.190354 0.217314 0.219690
charge: 0.093749 0.001416 0.097946 0.000151 0.119592 0.148888 0.078642 0.002322 0.007316 0.097186 -0.005017 0.000998 0.063311 0.248107 0.000191 0.000945 0.001205 0.005416 0.003086 0.027824 0.006727
qa: -0.2521 0.1908 -0.2782 0.1889 -0.0859 -0.0562 -0.3134 0.1898 0.1909 -0.2698 0.1816 0.1912 -0.3027 -0.0598 0.2353 0.1876 0.1964 0.2382 0.1904 0.2173 0.2197
va: 3.7199 0.9614 3.7517 0.9603 3.6361 3.6037 3.7897 0.9572 0.9604 3.7224 0.9555 0.9524 3.7520 3.5282 0.9370 0.9636 0.9540 0.9400 0.9569 0.9468 0.9490
energy: -312.311753248809
dipole: 0.56296 -0.75440 -0.19144 1.85581 -1.64152 0.21428 0.18322 -0.33407 -0.15085
magnitude: 0.32453 au
magnitude: 0.82490 debye
