program: Orca
programVersion: 5.0.3
elementType: C H C H C C C H H C H H C C H H H H H H H
charge: 1
multiplicity: 1
keywords: PBE0 cc-pVTZ EnGrad D3BJ RIJCOSX verytightscf cc-pVTZ/C def2/J soscf
formula: C8H13
InChI: InChI=1/C8H13/c1-2-4-6-8-7-5-3-1/h1-2,7H,3-6,8H2
21 atoms
C  -1.993731 0.542917 0.116685
H  -2.169328 0.730384 1.17987
C  -1.916595 -0.98534 -0.174085
H  -2.671379 -1.563779 0.36289
C  -0.4939 -1.200301 0.300882
C  0.621676 -1.163929 -0.487783
C  1.913745 -0.666894 0.069986
H  2.030603 -0.950456 1.12135
H  2.777913 -1.041283 -0.486484
C  1.868352 0.893629 -0.055685
H  1.960081 1.172481 -1.112266
H  2.72004 1.338571 0.46612
C  0.539552 1.477009 0.501445
C  -0.588693 0.938691 -0.286293
H  0.533556 -1.30894 -1.564343
H  -2.011356 -1.184745 -1.24602
H  0.412613 1.303903 1.574436
H  -0.453185 1.020859 -1.367982
H  -2.754035 1.066339 -0.473836
H  0.570449 2.570174 0.344334
H  -0.349433 -1.159668 1.38213
totalener: -312.07264072 hartree
nucrepener: 383.52363496 hartree
electener: -695.59627568 hartree
oneelecener: -1167.95334318 hartree
twoeener: 472.35706750 hartree
kineticenergy: 309.64326808 hartree
exchangeener: -34.161479412997 hartree
correlationener: -1.969157635224 hartree
xcener: -36.130637048222 hartree
chargesum: 1.0000000
charge: -0.159939 0.147162 -0.165521 0.154223 -0.070051 -0.091244 -0.179382 0.140666 0.155449 -0.199492 0.138263 0.153515 -0.165828 -0.027656 0.190011 0.142951 0.145553 0.189736 0.156708 0.176646 0.168229
charge: 0.089085 0.002326 0.093150 0.000022 0.121226 0.124995 0.076480 0.001517 0.007420 0.099821 -0.004780 0.000704 0.065553 0.276087 -0.004507 0.001341 0.002445 0.006432 0.006017 0.033209 0.001457
qa: -0.1599 0.1472 -0.1655 0.1542 -0.0701 -0.0912 -0.1794 0.1407 0.1554 -0.1995 0.1383 0.1535 -0.1658 -0.0277 0.1900 0.1430 0.1456 0.1897 0.1567 0.1766 0.1682
va: 3.8493 0.9936 3.8712 0.9877 3.8100 3.8119 3.8966 0.9936 0.9879 3.8726 0.9897 0.9853 3.8781 3.6840 0.9790 0.9957 0.9924 0.9811 0.9862 0.9790 0.9922
dispcorr: -0.018814168 hartree
energy: -312.091454887202
dipole: 0.55903 -0.79419 -0.23516 1.86640 -1.46726 0.39914 0.16869 -0.29961 -0.13092
magnitude: 0.48141 au
magnitude: 1.22365 debye
