program: Orca
programVersion: 5.0.3
elementType: C H C H C C C H H C H H C C H H H H H H H
charge: 1
multiplicity: 1
keywords: DSD-PBEP86 cc-pVTZ EnGrad D3BJ RIJCOSX verytightscf cc-pVTZ/C def2/J soscf
formula: C8H13
InChI: InChI=1/C8H13/c1-2-4-6-8-7-5-3-1/h1-2,7H,3-6,8H2
21 atoms
C  -1.993003 0.545699 0.115152
H  -2.168523 0.732446 1.178585
C  -1.909109 -0.983232 -0.174414
H  -2.670269 -1.558202 0.357624
C  -0.489338 -1.211074 0.304973
C  0.6238 -1.171245 -0.484271
C  1.915378 -0.669621 0.070581
H  2.03591 -0.949963 1.122388
H  2.780686 -1.040673 -0.486593
C  1.863805 0.889914 -0.059588
H  1.949831 1.166496 -1.117255
H  2.715393 1.340605 0.457539
C  0.535694 1.47469 0.503349
C  -0.596552 0.960252 -0.290319
H  0.533351 -1.30881 -1.561703
H  -2.00011 -1.181728 -1.246916
H  0.406888 1.290395 1.574126
H  -0.461574 1.053248 -1.371374
H  -2.760456 1.059646 -0.474684
H  0.578394 2.569593 0.35817
H  -0.346186 -1.174433 1.386565
totalener: -311.14032859 hartree
nucrepener: 383.17464239 hartree
electener: -694.31497098 hartree
oneelecener: -1166.64898834 hartree
twoeener: 472.33401736 hartree
kineticenergy: 309.72840611 hartree
exchangeener: -13.667476984257 hartree
correlationener: -0.924173656707 hartree
xcener: -14.591650640963 hartree
chargesum: 1.0000000
charge: -0.225821 0.171844 -0.227780 0.182854 -0.087786 -0.110298 -0.245556 0.163722 0.181514 -0.246783 0.157086 0.182238 -0.233301 -0.012913 0.217803 0.165935 0.169399 0.215228 0.184278 0.203781 0.194555
charge: 0.088755 0.001744 0.092898 -0.000569 0.123450 0.122816 0.075874 -0.000147 0.005953 0.100391 -0.006559 -0.000441 0.065220 0.290155 -0.005479 0.000160 0.001314 0.006730 0.005595 0.032204 -0.000065
qa: -0.2258 0.1718 -0.2278 0.1829 -0.0878 -0.1103 -0.2456 0.1637 0.1815 -0.2468 0.1571 0.1822 -0.2333 -0.0129 0.2178 0.1659 0.1694 0.2152 0.1843 0.2038 0.1946
va: 3.8650 0.9836 3.8885 0.9760 3.8176 3.8216 3.9177 0.9848 0.9767 3.8878 0.9824 0.9722 3.9053 3.6659 0.9643 0.9867 0.9831 0.9670 0.9752 0.9662 0.9784
dispcorr: -0.011978741 hartree
energy: -311.844883431167
dipole: 0.55602 -0.82710 -0.27108 1.87088 -1.44350 0.42739 0.16520 -0.30111 -0.13591
magnitude: 0.52404 au
magnitude: 1.33200 debye
