program: Orca
programVersion: 5.0.3
elementType: C H C H C C C H H C H H C C H H H H H H H
charge: 1
multiplicity: 1
keywords: PBE0 cc-pVTZ EnGrad D3BJ RIJCOSX verytightscf cc-pVTZ/C def2/J soscf
formula: C8H13
InChI: InChI=1/C8H13/c1-2-4-6-8-7-5-3-1/h1-2,7H,3-6,8H2
21 atoms
C  -1.993364 0.544295 0.11595
H  -2.16891 0.731401 1.179259
C  -1.91285 -0.984281 -0.174262
H  -2.670836 -1.561006 0.36022
C  -0.491616 -1.205729 0.302914
C  0.622737 -1.167606 -0.486046
C  1.914544 -0.668263 0.070294
H  2.033223 -0.950217 1.121885
H  2.779304 -1.040974 -0.4865
C  1.866057 0.89177 -0.057631
H  1.954899 1.169473 -1.114767
H  2.717729 1.339591 0.461787
C  0.537641 1.475909 0.502413
C  -0.592617 0.949495 -0.288325
H  0.533474 -1.308951 -1.563041
H  -2.005721 -1.183198 -1.24649
H  0.409759 1.297265 1.574322
H  -0.457272 1.036788 -1.369719
H  -2.757275 1.063004 -0.474204
H  0.574474 2.569972 0.351234
H  -0.347793 -1.167021 1.384334
totalener: -312.07172365 hartree
nucrepener: 383.34782729 hartree
electener: -695.41955094 hartree
oneelecener: -1167.60742447 hartree
twoeener: 472.18787353 hartree
kineticenergy: 309.64233852 hartree
exchangeener: -34.160774734047 hartree
correlationener: -1.968754469695 hartree
xcener: -36.129529203742 hartree
chargesum: 1.0000000
charge: -0.160158 0.147505 -0.165425 0.154129 -0.071945 -0.094421 -0.178989 0.140649 0.155352 -0.199416 0.138194 0.153556 -0.166014 -0.024204 0.189520 0.143028 0.145930 0.190706 0.156931 0.177200 0.167874
charge: 0.088734 0.002503 0.092712 0.000034 0.120617 0.121991 0.076080 0.001420 0.007402 0.100168 -0.004816 0.000694 0.065725 0.279952 -0.004998 0.001372 0.002616 0.006815 0.006353 0.033851 0.000776
qa: -0.1602 0.1475 -0.1654 0.1541 -0.0719 -0.0944 -0.1790 0.1406 0.1554 -0.1994 0.1382 0.1536 -0.1660 -0.0242 0.1895 0.1430 0.1459 0.1907 0.1569 0.1772 0.1679
va: 3.8485 0.9935 3.8714 0.9877 3.8109 3.8136 3.8960 0.9936 0.9879 3.8722 0.9897 0.9853 3.8785 3.6790 0.9793 0.9957 0.9924 0.9805 0.9863 0.9789 0.9922
dispcorr: -0.018840079 hartree
energy: -312.090563725451
dipole: 0.55763 -0.80043 -0.24280 1.86855 -1.44243 0.42612 0.16693 -0.29674 -0.12981
magnitude: 0.50732 au
magnitude: 1.28951 debye
