program: Orca
programVersion: 5.0.3
elementType: C H C H C C C H H C H H C C H H H H H H H
charge: 1
multiplicity: 1
keywords: PBE0 cc-pVTZ EnGrad D3BJ RIJCOSX verytightscf cc-pVTZ/C def2/J soscf
formula: C8H13
InChI: InChI=1/C8H13/c1-2-4-6-8-7-5-3-1/h1-2,7H,3-6,8H2
21 atoms
C  -1.994902 0.613941 0.081506
H  -2.172929 0.777979 1.150831
C  -1.806203 -0.952561 -0.171762
H  -2.64365 -1.463335 0.312556
C  -0.428946 -1.326908 0.361361
C  0.658712 -1.25039 -0.427451
C  1.957176 -0.702784 0.07147
H  2.134742 -0.941793 1.125059
H  2.823917 -1.034199 -0.510576
C  1.815598 0.843005 -0.109183
H  1.85371 1.101016 -1.173579
H  2.641162 1.367692 0.379755
C  0.468111 1.396488 0.507121
C  -0.707295 1.205454 -0.326423
H  0.522584 -1.241817 -1.511707
H  -1.863698 -1.146406 -1.247457
H  0.312193 1.039586 1.527501
H  -0.617819 1.542477 -1.364214
H  -2.835075 0.989432 -0.510219
H  0.614849 2.497091 0.539769
H  -0.314721 -1.38023 1.444807
totalener: -312.04818745 hartree
nucrepener: 379.85044760 hartree
electener: -691.89863505 hartree
oneelecener: -1160.71397908 hartree
twoeener: 468.81534403 hartree
kineticenergy: 309.63270055 hartree
exchangeener: -34.150170978260 hartree
correlationener: -1.961454044982 hartree
xcener: -36.111625023242 hartree
chargesum: 1.0000000
charge: -0.165039 0.160610 -0.176648 0.153673 -0.130808 -0.135604 -0.168654 0.140115 0.152607 -0.195078 0.138957 0.153566 -0.177900 0.070228 0.159686 0.148457 0.151093 0.208273 0.164855 0.186147 0.161464
charge: 0.098149 0.013003 0.102667 0.000807 0.074438 0.055138 0.071533 -0.000704 0.006252 0.114643 -0.006910 0.000491 0.075967 0.342882 -0.015246 0.000690 0.006548 0.018756 0.010379 0.047759 -0.017241
qa: -0.1650 0.1606 -0.1766 0.1537 -0.1308 -0.1356 -0.1687 0.1401 0.1526 -0.1951 0.1390 0.1536 -0.1779 0.0702 0.1597 0.1485 0.1511 0.2083 0.1649 0.1861 0.1615
va: 3.8336 0.9880 3.8887 0.9858 3.8234 3.8366 3.8815 0.9942 0.9879 3.8626 0.9906 0.9854 3.8915 3.5511 0.9892 0.9912 0.9954 0.9705 0.9869 0.9786 0.9932
dispcorr: -0.018860821 hartree
energy: -312.067048271277
dipole: 0.42650 -0.91694 -0.49043 1.97302 -0.79843 1.17460 0.15210 -0.27463 -0.12253
magnitude: 1.27875 au
magnitude: 3.25033 debye
