program: Orca
programVersion: 5.0.3
elementType: C H C H C C C H H C H H C C H H H H H H H
charge: 1
multiplicity: 1
keywords: DSD-PBEP86 cc-pVTZ EnGrad D3BJ RIJCOSX verytightscf cc-pVTZ/C def2/J soscf
formula: C8H13
InChI: InChI=1/C8H13/c1-2-4-6-8-7-5-3-1/h1-2,7H,3-6,8H2
21 atoms
C  -1.997597 0.758467 0.071335
H  -2.165969 0.839453 1.148032
C  -1.732194 -0.960571 -0.155077
H  -2.618367 -1.316292 0.375022
C  -0.419301 -1.384283 0.39518
C  0.688008 -1.27887 -0.374111
C  2.002897 -0.6898 0.063608
H  2.212545 -0.883932 1.121154
H  2.856642 -1.03254 -0.526655
C  1.791057 0.866481 -0.142686
H  1.837651 1.123238 -1.206525
H  2.595788 1.412246 0.356606
C  0.421678 1.255266 0.482487
C  -0.767054 1.305825 -0.377363
H  0.524083 -1.206872 -1.454007
H  -1.836727 -1.124015 -1.228095
H  0.173868 0.508873 1.246443
H  -0.656648 1.55299 -1.436767
H  -2.88058 0.987655 -0.523847
H  0.448727 2.177833 1.094674
H  -0.339066 -1.49357 1.476637
totalener: -311.09515482 hartree
nucrepener: 379.70033381 hartree
electener: -690.79548863 hartree
oneelecener: -1159.78405025 hartree
twoeener: 468.98856162 hartree
kineticenergy: 309.72532001 hartree
exchangeener: -13.661533456440 hartree
correlationener: -0.921657105733 hartree
xcener: -14.583190562173 hartree
chargesum: 1.0000000
charge: -0.262444 0.199122 -0.242143 0.200801 -0.147790 -0.124974 -0.236117 0.155974 0.174300 -0.260140 0.159811 0.177993 -0.246816 0.105220 0.164540 0.191071 0.153069 0.230088 0.203528 0.220939 0.183968
charge: 0.131980 0.013652 0.174003 0.008364 0.019493 0.071870 0.076900 -0.005174 -0.003922 0.105523 -0.012950 -0.001862 0.076025 0.312268 -0.017362 -0.000683 0.007576 0.017030 0.006880 0.041028 -0.020641
qa: -0.2624 0.1991 -0.2421 0.2008 -0.1478 -0.1250 -0.2361 0.1560 0.1743 -0.2601 0.1598 0.1780 -0.2468 0.1052 0.1645 0.1911 0.1531 0.2301 0.2035 0.2209 0.1840
va: 3.8872 0.9713 3.9116 0.9650 3.8262 3.8442 3.9071 0.9870 0.9769 3.8904 0.9844 0.9756 3.8864 3.5571 0.9831 0.9720 1.0089 0.9595 0.9713 0.9620 0.9825
dispcorr: -0.011932114 hartree
energy: -311.801304018041
dipole: 0.14222 -1.06184 -0.91962 1.44662 -0.37575 1.07087 0.41460 -0.52662 -0.11201
magnitude: 1.41599 au
magnitude: 3.59915 debye
