program: Orca
programVersion: 5.0.3
elementType: C H C H C C C H H C H H C C H H H H H H H
charge: 1
multiplicity: 1
keywords: DSD-PBEP86/2013 cc-pVTZ EnGrad D3BJ RIJCOSX verytightscf cc-pVTZ/C def2/J soscf
formula: C8H13
InChI: InChI=1/C8H12.H/c1-2-4-6-8-7-5-3-1;/h1-2,7-8H,3-6H2;
21 atoms
C  -1.975895 0.654195 0.123672
H  -2.128938 0.845525 1.190479
C  -1.84993 -0.948827 -0.119685
H  -2.653018 -1.441019 0.431969
C  -0.469466 -1.348259 0.373103
C  0.673167 -1.25893 -0.384773
C  1.975845 -0.654956 0.111444
H  2.132229 -0.855651 1.176088
H  2.844913 -1.012569 -0.443786
C  1.85024 0.949246 -0.116833
H  1.971476 1.172964 -1.181468
H  2.654309 1.437215 0.437225
C  0.470771 1.343457 0.383942
C  -0.674991 1.261303 -0.371854
H  0.550055 -1.266483 -1.471257
H  -1.974319 -1.162023 -1.186031
H  0.000526 0.003063 0.002563
H  -0.554812 1.27493 -1.458288
H  -2.84659 1.015819 -0.426194
H  0.351345 1.334244 1.467929
H  -0.345914 -1.341309 1.460072
totalener: -311.09354860 hartree
nucrepener: 382.90672897 hartree
electener: -694.00027757 hartree
oneelecener: -1165.68178283 hartree
twoeener: 471.68150526 hartree
kineticenergy: 309.66829215 hartree
exchangeener: -14.115332276632 hartree
correlationener: -0.949368796167 hartree
xcener: -15.064701072799 hartree
chargesum: 1.0000000
charge: -0.257411 0.171833 -0.256299 0.186853 -0.059492 -0.058498 -0.256963 0.171731 0.185861 -0.255836 0.171047 0.186755 -0.060526 -0.057190 0.186235 0.171001 0.083076 0.186640 0.186147 0.188519 0.186518
charge: 0.110592 -0.003606 0.110581 0.001757 0.139010 0.140228 0.110123 -0.003592 0.001703 0.110878 -0.003625 0.001863 0.141756 0.142286 0.003100 -0.003754 -0.010248 0.003463 0.001721 0.002235 0.003532
qa: -0.2574 0.1718 -0.2563 0.1869 -0.0595 -0.0585 -0.2570 0.1717 0.1859 -0.2558 0.1710 0.1868 -0.0605 -0.0572 0.1862 0.1710 0.0831 0.1866 0.1861 0.1885 0.1865
va: 3.9012 0.9815 3.8996 0.9735 3.8022 3.8032 3.9014 0.9815 0.9741 3.8993 0.9822 0.9736 3.8010 3.8018 0.9827 0.9822 1.1511 0.9826 0.9740 0.9821 0.9827
dispcorr: -0.014364512 hartree
energy: -311.793385957580
dipole: 0.00139 -0.00267 -0.00129 0.00760 0.00329 0.01089 0.00074 -0.00212 -0.00138
magnitude: 0.01105 au
magnitude: 0.02809 debye
