program: Orca
programVersion: 5.0.3
elementType: C H C H C C C H H C H H C C H H H H H H H
charge: 1
multiplicity: 1
keywords: b3lyp cc-pVTZ EnGrad RIJCOSX verytightscf cc-pVTZ/C def2/J soscf
formula: C8H13
InChI: InChI=1/C8H13/c1-2-4-6-8-7-5-3-1/h1-2,7H,3-6,8H2
21 atoms
C  -1.997068 0.531378 0.120048
H  -2.174447 0.723357 1.18181
C  -1.950467 -0.995568 -0.171029
H  -2.675345 -1.587052 0.390743
C  -0.51469 -1.148184 0.284325
C  0.611875 -1.129137 -0.501871
C  1.907957 -0.653926 0.065829
H  2.010142 -0.952114 1.114664
H  2.764575 -1.044316 -0.490401
C  1.891057 0.910553 -0.038479
H  2.01188 1.201212 -1.088721
H  2.73957 1.329086 0.509212
C  0.555208 1.481576 0.491797
C  -0.553791 0.840107 -0.26694
H  0.5316 -1.302295 -1.574635
H  -2.062739 -1.203081 -1.239342
H  0.437385 1.353161 1.572587
H  -0.425437 0.902643 -1.35049
H  -2.721902 1.094447 -0.476836
H  0.530504 2.564107 0.284922
H  -0.365353 -1.097432 1.36419
totalener: -312.24938190 hartree
nucrepener: 385.20427933 hartree
electener: -697.45366122 hartree
oneelecener: -1171.28100050 hartree
twoeener: 473.82733928 hartree
kineticenergy: 310.00167421 hartree
exchangeener: -36.321122306580 hartree
correlationener: -2.308479582378 hartree
xcener: -38.629601888958 hartree
chargesum: 1.0000000
charge: -0.161917 0.140797 -0.172088 0.153707 -0.040605 -0.043171 -0.186411 0.135213 0.154371 -0.189522 0.132006 0.152390 -0.167374 -0.030132 0.186422 0.138014 0.135397 0.175797 0.153839 0.168652 0.164615
charge: 0.098741 -0.001188 0.102957 -0.002218 0.125567 0.156181 0.085026 0.000060 0.005637 0.102160 -0.007180 -0.001226 0.069821 0.239288 -0.002097 -0.001519 -0.001912 0.001621 0.000564 0.024615 0.005103
qa: -0.1619 0.1408 -0.1721 0.1537 -0.0406 -0.0432 -0.1864 0.1352 0.1544 -0.1895 0.1320 0.1524 -0.1674 -0.0301 0.1864 0.1380 0.1354 0.1758 0.1538 0.1687 0.1646
va: 3.8243 0.9917 3.8407 0.9833 3.7665 3.7588 3.8739 0.9908 0.9832 3.8400 0.9879 0.9806 3.8492 3.6697 0.9776 0.9930 0.9914 0.9897 0.9815 0.9754 0.9929
energy: -312.249381896850
dipole: 0.56268 -0.72997 -0.16729 1.85503 -1.69499 0.16004 0.18512 -0.33107 -0.14595
magnitude: 0.27368 au
magnitude: 0.69565 debye
