program: Orca
programVersion: 5.0.3
elementType: C H C H C C C H H C H H C C H H H H H H H
charge: 1
multiplicity: 1
keywords: PBE0 def2-TZVP EnGrad RIJCOSX verytightscf def2/J soscf
formula: C8H13
InChI: InChI=1/C8H13/c1-2-4-6-8-7-5-3-1/h1-2,7H,3-6,8H2
21 atoms
C  -2.000567 0.757227 0.069293
H  -2.162329 0.822307 1.147889
C  -1.729699 -0.971864 -0.161671
H  -2.618723 -1.324606 0.365272
C  -0.413752 -1.387441 0.390696
C  0.684185 -1.273669 -0.381807
C  1.999387 -0.694991 0.062586
H  2.205512 -0.897513 1.119091
H  2.854817 -1.035586 -0.52709
C  1.787893 0.849039 -0.137131
H  1.824831 1.112061 -1.200041
H  2.591833 1.399365 0.35877
C  0.423063 1.272861 0.493611
C  -0.767278 1.296102 -0.367067
H  0.519143 -1.195811 -1.461157
H  -1.83143 -1.13101 -1.235679
H  0.203886 0.660064 1.372188
H  -0.659376 1.61696 -1.406879
H  -2.883176 0.995945 -0.522389
H  0.48859 2.306102 0.898413
H  -0.330559 -1.480526 1.472806
totalener: -312.03752661 hartree
nucrepener: 379.31511885 hartree
electener: -691.35264547 hartree
oneelecener: -1159.69954905 hartree
twoeener: 468.34690358 hartree
kineticenergy: 310.16918365 hartree
exchangeener: -34.166187803739 hartree
correlationener: -1.960883673824 hartree
xcener: -36.127071477563 hartree
chargesum: 1.0000000
charge: -0.251648 0.202229 -0.210511 0.196726 -0.207560 -0.079764 -0.223626 0.159179 0.166198 -0.268565 0.158610 0.171929 -0.164953 0.072880 0.136715 0.190989 0.161644 0.204205 0.196607 0.216331 0.172386
charge: -0.165249 0.175180 -0.119015 0.165069 -0.187548 -0.119152 -0.225107 0.154864 0.154529 -0.208665 0.149307 0.157383 -0.211866 0.092722 0.156454 0.158261 0.174983 0.173977 0.163317 0.207430 0.153125
qa: -0.2516 0.2022 -0.2105 0.1967 -0.2076 -0.0798 -0.2236 0.1592 0.1662 -0.2686 0.1586 0.1719 -0.1650 0.0729 0.1367 0.1910 0.1616 0.2042 0.1966 0.2163 0.1724
va: 3.9234 0.9564 3.8746 0.9558 3.9159 3.9016 3.9161 0.9702 0.9729 3.9723 0.9679 0.9653 3.8553 3.7024 0.9678 0.9584 0.9937 0.9504 0.9639 0.9477 0.9626
energy: -312.037526613456
dipole: 0.19011 -1.04085 -0.85075 1.73039 -0.59202 1.13837 0.35696 -0.47767 -0.12072
magnitude: 1.42626 au
magnitude: 3.62527 debye
