program: Orca
programVersion: 5.0.3
elementType: C H C H C C C H H C H H C C H H H H H H H
charge: 1
multiplicity: 1
keywords: b3lyp cc-pVTZ EnGrad RIJCOSX verytightscf cc-pVTZ/C def2/J soscf
formula: C8H13
InChI: InChI=1/C8H13/c1-2-4-6-8-7-5-3-1/h1-2,7H,3-6,8H2
21 atoms
C  -1.9941 0.541562 0.117355
H  -2.169777 0.729399 1.180414
C  -1.920344 -0.986411 -0.173882
H  -2.671897 -1.566521 0.365635
C  -0.496189 -1.194793 0.29888
C  0.620616 -1.160216 -0.489484
C  1.912981 -0.665514 0.069653
H  2.028051 -0.950682 1.120781
H  2.776511 -1.041601 -0.486546
C  1.870692 0.895492 -0.05375
H  1.965376 1.175519 -1.109749
H  2.722325 1.337546 0.470537
C  0.541428 1.477991 0.500447
C  -0.584781 0.927844 -0.284228
H  0.533593 -1.308779 -1.56561
H  -2.017013 -1.186374 -1.245506
H  0.415453 1.310311 1.574474
H  -0.449312 1.00548 -1.366175
H  -2.750733 1.069647 -0.473587
H  0.566326 2.570198 0.337476
H  -0.351106 -1.152379 1.379958
totalener: -312.24467130 hartree
nucrepener: 383.70186791 hartree
electener: -695.94653921 hartree
oneelecener: -1168.32768208 hartree
twoeener: 472.38114287 hartree
kineticenergy: 309.98962148 hartree
exchangeener: -36.313615693678 hartree
correlationener: -2.307046496294 hartree
xcener: -38.620662189972 hartree
chargesum: 1.0000000
charge: -0.164296 0.142695 -0.167514 0.153104 -0.056015 -0.070195 -0.184298 0.134571 0.153346 -0.187605 0.130491 0.152885 -0.165066 -0.006321 0.182907 0.137732 0.138476 0.184092 0.155301 0.173658 0.162051
charge: 0.093776 -0.000141 0.097783 -0.002027 0.124782 0.131515 0.081225 -0.000860 0.005333 0.103776 -0.007290 -0.001367 0.070291 0.274088 -0.006463 -0.001148 -0.000271 0.003614 0.003612 0.030283 -0.000510
qa: -0.1643 0.1427 -0.1675 0.1531 -0.0560 -0.0702 -0.1843 0.1346 0.1533 -0.1876 0.1305 0.1529 -0.1651 -0.0063 0.1829 0.1377 0.1385 0.1841 0.1553 0.1737 0.1621
va: 3.8220 0.9908 3.8402 0.9830 3.7756 3.7767 3.8728 0.9913 0.9832 3.8357 0.9885 0.9803 3.8510 3.6342 0.9795 0.9930 0.9913 0.9843 0.9817 0.9747 0.9927
energy: -312.244671297916
dipole: 0.56021 -0.78944 -0.22923 1.86445 -1.49981 0.36464 0.17048 -0.30320 -0.13273
magnitude: 0.45070 au
magnitude: 1.14558 debye
