program: Orca
programVersion: 5.0.3
elementType: C H C H C C C H H C H H C C H H H H H H H
charge: 1
multiplicity: 1
keywords: m062x def2-TZVP EnGrad RIJCOSX verytightscf def2/J soscf
formula: C8H13
InChI: InChI=1/C8H13/c1-2-4-6-8-7-5-3-1/h1-2,7H,3-6,8H2
21 atoms
C  -2.003907 0.71726 0.082113
H  -2.210494 0.876792 1.144293
C  -1.768158 -0.926107 -0.142819
H  -2.61981 -1.375388 0.372459
C  -0.430778 -1.352189 0.41037
C  0.698596 -1.284185 -0.363371
C  2.009682 -0.686795 0.07213
H  2.223485 -0.880219 1.128528
H  2.859252 -1.019801 -0.527654
C  1.803215 0.90083 -0.143083
H  1.862716 1.133158 -1.211484
H  2.618443 1.42568 0.358531
C  0.426383 1.278391 0.432095
C  -0.736718 1.318265 -0.367043
H  0.530658 -1.205896 -1.442164
H  -1.853667 -1.128735 -1.2133
H  0.057067 0.155712 0.645081
H  -0.591311 1.316483 -1.451787
H  -2.867281 0.995704 -0.523404
H  0.358437 1.632257 1.467222
H  -0.347434 -1.514489 1.487235
totalener: -312.24156478 hartree
nucrepener: 381.64974659 hartree
electener: -693.89131137 hartree
oneelecener: -1163.80682112 hartree
twoeener: 469.91550974 hartree
kineticenergy: 310.34371521 hartree
xcener: -23.095080049081 hartree
chargesum: 1.0000000
charge: -0.304556 0.213305 -0.355987 0.211614 -0.099593 -0.103698 -0.303036 0.201664 0.200841 -0.371784 0.211018 0.204054 -0.098034 0.000060 0.180459 0.216475 0.103597 0.207496 0.211202 0.248913 0.225991
charge: -0.191949 0.161501 -0.180763 0.163029 -0.191840 -0.085317 -0.213919 0.156121 0.156477 -0.202625 0.153703 0.157998 -0.196883 0.024435 0.161485 0.156454 0.289965 0.171002 0.162684 0.184061 0.164382
qa: -0.3046 0.2133 -0.3560 0.2116 -0.0996 -0.1037 -0.3030 0.2017 0.2008 -0.3718 0.2110 0.2041 -0.0980 0.0001 0.1805 0.2165 0.1036 0.2075 0.2112 0.2489 0.2260
va: 3.7123 0.9466 3.8065 0.9536 3.4780 3.7694 3.7124 0.9500 0.9578 3.8081 0.9434 0.9599 3.4571 3.6765 0.9524 0.9422 1.0175 0.9434 0.9545 0.9373 0.9420
energy: -312.241564782894
dipole: 0.01882 -0.36922 -0.35040 0.38585 0.10221 0.48807 0.21913 -0.25307 -0.03395
magnitude: 0.60178 au
magnitude: 1.52961 debye
