program: Gaussian 09
title: 000050757
version: EM64L-G09RevD.01
frameworkgroup: C1[X(C17H28N2O2)]
method: RPBEPBE
basis: SDD
operation: Freq
keyword: #p
keyword: freq=noraman
keyword: PBEPBE/SDD
title: #p freq=noraman PBEPBE/SDD
converged: YES YES NO NO
title: Mulliken charges:
elementType: O O N N C C C C C C C C C C C C C C C C C H H H H H H H H H H H H H H H H H H H H H H H H H H H H
charge: -0.297735 -0.269789 -0.301456 -0.684972 0.003837 -0.437024 -0.459033 -0.379113 -0.373292 -0.354094 -0.723957 -0.365619 -0.697664 -0.270757 0.183413 0.226468 -0.335836 -0.325571 -0.406351 -0.400443 0.500074 0.177601 0.191497 0.198817 0.217211 0.200000 0.187136 0.224751 0.191777 0.200930 0.194432 0.195815 0.250438 0.221156 0.215483 0.205217 0.195890 0.218948 0.209268 0.216652 0.209914 0.242443 0.212772 0.265281 0.264553 0.220914 0.218992 0.310244 0.310781
chargesum: 0.00000
title: Mulliken charges with hydrogens summed into heavy atoms:
elementType: O O N N C C C C C C C C C C C C C C C C C
charge: -0.297735 -0.269789 -0.051018 -0.063946 0.181437 -0.046710 -0.041822 0.032774 0.019415 0.036153 -0.082100 0.049219 -0.061830 0.184458 0.183413 0.226468 -0.070555 -0.061018 -0.185437 -0.181451 0.500074
polarizability: 3.00756803e+02 -1.46727692e+01 1.61705703e+02 2.05916677e+01 -2.26454414e+00 1.93602037e+02
1716.lowfreq: -10.3398 0.0000 0.0004 0.0011 1.9327 3.3071 11.1932 12.5993 23.7568
frequency: 10.5072 12.3267 23.3770 31.4425 50.2208 61.0705 69.8001 78.6604 82.0351 95.8473 98.2172 112.7518 130.8098 155.4037 175.6868 186.0293 215.9386 229.5825 244.5505 249.9522 284.7515 292.4221 294.1863 325.0814 359.1597 380.1387 403.0000 410.6508 411.1925 416.2428 443.8737 487.0792 507.1794 508.3423 580.4684 608.2231 634.0309 677.1795 679.9836 729.2510 755.1405 764.5334 776.2011 786.9736 808.3300 824.0599 825.3546 827.6097 843.8426 892.5398 901.8501 919.6846 925.1846 966.1032 973.5847 984.5742 998.5928 1002.7336 1013.9213 1018.2170 1032.6167 1051.1642 1059.8842 1079.2280 1079.7283 1087.5533 1097.2145 1113.2135 1130.3720 1144.2076 1154.9166 1171.1367 1180.3282 1186.1889 1212.0399 1236.9190 1244.5941 1252.4735 1260.7436 1270.0771 1270.9792 1285.5020 1289.1971 1307.5238 1309.7756 1325.1176 1328.5156 1343.3303 1348.4482 1353.6194 1360.6276 1389.2784 1389.6945 1392.3115 1397.7246 1448.0575 1449.7721 1459.5901 1465.4430 1472.7705 1474.0794 1475.8414 1476.6602 1482.8446 1483.9470 1490.5153 1492.7079 1501.1639 1517.2839 1570.7231 1612.9345 1632.1208 1646.4709 2865.0644 2884.8607 2944.3017 2949.9380 2955.3411 2966.7857 2970.6358 2971.0386 2973.2649 2988.0637 3000.1548 3006.0749 3011.1959 3027.0220 3028.2274 3032.6647 3065.7201 3067.0141 3070.6857 3074.0899 3079.5167 3123.0353 3125.8323 3158.5560 3172.8466 3430.3607 3561.0604 3700.9878
redmass: 4.1671 4.9532 3.7914 4.5457 3.0159 3.0342 1.8684 3.0542 2.1035 3.4680 3.4034 2.9809 2.8582 1.9194 3.2563 3.1166 3.6548 1.2283 1.3082 3.0172 3.8576 4.4196 3.5813 2.3725 4.5197 3.2507 3.7862 1.2138 1.2640 1.9589 2.6563 2.7168 4.3248 2.8517 2.5679 6.2458 6.8691 3.5152 1.3843 1.0847 4.4301 1.2139 2.8643 2.3208 1.1999 1.6005 1.2640 4.4576 1.8419 1.8172 2.2453 1.4932 3.1736 1.7246 1.3629 1.3508 3.1051 2.3404 1.8837 1.4684 1.5911 2.6932 4.5171 2.0289 1.8905 2.2556 2.3869 2.1581 1.2170 2.1590 1.8262 2.7940 1.1617 1.3375 1.4786 1.2420 1.2910 2.4179 1.2369 1.1672 1.2177 1.2001 1.1092 1.3288 1.2941 2.5820 1.5159 1.5254 1.6068 1.5372 1.3472 1.2316 1.2258 4.8211 1.4828 4.1736 1.1621 1.0926 1.0727 1.0757 1.0698 1.0554 1.0427 1.0637 1.0742 1.0940 1.0806 1.0717 3.2020 7.3028 10.2493 3.1870 1.4497 1.0723 1.0706 1.0782 1.0622 1.0615 1.0592 1.0541 1.0366 1.0444 1.0968 1.0612 1.1000 1.0867 1.0871 1.1010 1.1009 1.0990 1.1007 1.0992 1.0995 1.1056 1.0894 1.0893 1.0953 1.0948 1.0735 1.0450 1.1040
irintensity: 0.0048 1.7012 0.2322 0.6403 0.2505 1.5647 0.4660 0.7207 2.1335 0.2360 0.4885 1.3158 0.2597 2.8166 2.1364 1.2706 3.9895 0.7713 0.1321 1.2897 4.7795 8.2629 3.9549 0.5021 2.3171 2.3579 17.8309 84.0664 230.6526 0.6565 0.1562 0.2565 7.1340 2.9146 4.6349 11.2943 2.5749 19.1255 82.8451 5.6546 12.5512 13.9123 12.4879 2.2645 0.6165 0.6736 0.4882 1.7334 72.8579 7.7979 3.8232 3.1893 11.9942 9.0031 0.1299 0.2233 23.3592 18.7430 6.4672 12.1255 0.5010 2.0463 387.2821 23.7787 3.1957 65.0810 11.2383 40.8221 13.3870 16.7238 4.3624 67.6240 164.8121 0.7029 1.1900 4.8628 8.9766 338.5499 23.2250 5.2484 1.6475 1.9516 0.4325 4.1646 2.3354 98.5882 20.2256 4.0118 1.8482 0.7817 22.7537 6.8928 19.7253 11.9087 8.4857 7.8712 23.9096 12.3449 4.2246 6.7355 4.2901 4.5414 12.2631 17.2152 4.3452 17.6840 9.4168 16.4061 70.7559 28.4800 359.8774 93.1169 323.6040 79.1492 106.4657 15.6500 8.2500 23.1530 54.8107 92.9639 41.2865 24.4103 4.0697 25.0659 12.1800 36.5903 26.6317 11.3046 87.5158 45.9837 98.9100 54.0189 77.9503 33.6630 15.4621 22.9212 9.4887 3.8737 1.6699 111.3667 23.0580
temp: 298.150 k
press: 1.00000 atm
elementType: 8 8 7 7 6 6 6 6 6 6 6 6 6 6 6 6 6 6 6 6 6 1 1 1 1 1 1 1 1 1 1 1 1 1 1 1 1 1 1 1 1 1 1 1 1 1 1 1 1
symmnumber: 1
zpe: 1112821.3 jmol-1
zpe.correction: 0.423851 hartree
zpe.thermalcorrener: 0.448144 hartree
zpe.thermalcorrenthalpy: 0.449088 hartree
zpe.thermalcorrgfe: 0.365137 hartree
zpe.sumelectzpe: -922.919637 hartree
zpe.sumelectthermal: -922.895344 hartree
zpe.sumelectthermalent: -922.894400 hartree
zpe.sumelectthermalfe: -922.978351 hartree
dipole: -2.7384 1.3317 -3.6623
dipole: 4.7628
quadrupole: -73.8173 -134.1302 -129.3179
quadrupole: -4.0437 13.7501 1.2574
quadrupole: 38.6045 -21.7084 -16.8961 -4.0437 13.7501 1.2574
hfenergy: -923.3434879 hartree
pointgroup: C01 [X(C17H28N2O2)]
dipole: -1.0819664 -0.5191251 1.4391482 debye
polarizability: 301.1093939|12.3121801|161.2559355|-20.8664716|-2.2671492|193.6992134 unknown
InChI: InChI=1S/C17H28N2O2/c1-3-5-6-14(4-2)13-19-11-12-21-17(20)15-7-9-16(18)10-8-15/h7-10,14,19H,3-6,11-13,18H2,1-2H3
charge 0 multiplicity 1
49 atoms
O  -1.384394 0.299694 -0.114752
O  -2.209956 0.235422 -2.29658
N  2.329556 0.578794 0.01982
N  -7.601772 -0.468109 1.291639
C  4.767953 0.993994 0.503115
C  5.275606 -0.213471 -0.337068
C  3.345583 0.767302 1.0801
C  4.863369 2.301967 -0.32939
C  5.2486 -1.581447 0.382674
C  5.903905 -2.709017 -0.448172
C  4.651774 3.597164 0.48368
C  0.941866 0.457556 0.511866
C  5.858413 -4.082174 0.256107
C  -0.022261 0.480935 -0.678095
C  -2.424433 0.191842 -1.05611
C  -3.745154 0.024302 -0.412302
C  -4.893882 -0.100424 -1.240903
C  -3.912194 -0.018474 0.999029
C  -6.170133 -0.263133 -0.685056
C  -5.184781 -0.181035 1.566345
C  -6.3385 -0.306717 0.733151
H  5.442954 1.092948 1.382445
H  4.695696 -0.279552 -1.282725
H  6.319123 0.002105 -0.647204
H  3.049683 1.654415 1.672693
H  3.374123 -0.089371 1.79873
H  5.862289 2.337073 -0.810853
H  4.112991 2.252952 -1.141883
H  5.772618 -1.495778 1.3578
H  4.204191 -1.872839 0.618756
H  5.395754 -2.779015 -1.432016
H  6.957247 -2.436041 -0.663423
H  2.57681 -0.206711 -0.598544
H  3.624869 3.661404 0.886911
H  4.811234 4.489912 -0.148939
H  5.35687 3.657297 1.335375
H  0.754505 -0.46327 1.116512
H  0.728474 1.322127 1.167993
H  4.814689 -4.392741 0.452889
H  6.334696 -4.869014 -0.357349
H  6.385407 -4.046467 1.228479
H  0.031348 1.439887 -1.221921
H  0.181059 -0.335678 -1.397489
H  -4.756719 -0.066133 -2.327003
H  -3.031059 0.077652 1.63974
H  -7.04634 -0.357605 -1.337888
H  -5.299577 -0.212098 2.65676
H  -7.727134 -0.497734 2.299498
H  -8.424764 -0.557396 0.702458
