program: Orca
programVersion: 5.0.3
elementType: C H C H C C C H H C H H C C H H H H H H H
charge: 1
multiplicity: 1
keywords: PBE0 def2-TZVP EnGrad D3BJ RIJCOSX verytightscf def2/J soscf
formula: C8H13
InChI: InChI=1/C8H13/c1-2-4-6-8-7-5-3-1/h1-2,7H,3-6,8H2
21 atoms
C  -1.993404 0.603596 0.083962
H  -2.171306 0.772838 1.152428
C  -1.815345 -0.95462 -0.172091
H  -2.646606 -1.474059 0.31352
C  -0.43384 -1.318501 0.357347
C  0.655401 -1.245669 -0.432319
C  1.95231 -0.700648 0.071934
H  2.125386 -0.942651 1.125605
H  2.819561 -1.034548 -0.507901
C  1.819062 0.84633 -0.105991
H  1.858983 1.104574 -1.170345
H  2.648171 1.365491 0.382961
C  0.474541 1.406079 0.508592
C  -0.698092 1.190346 -0.324504
H  0.523862 -1.251838 -1.516823
H  -1.872763 -1.149399 -1.247766
H  0.321928 1.06235 1.534149
H  -0.606561 1.513009 -1.366677
H  -2.828964 0.991391 -0.507084
H  0.619142 2.506734 0.52605
H  -0.316254 -1.364367 1.440921
totalener: -312.05403187 hartree
nucrepener: 380.02021901 hartree
electener: -692.07425088 hartree
oneelecener: -1161.09267588 hartree
twoeener: 469.01842500 hartree
kineticenergy: 310.15764842 hartree
exchangeener: -34.169819679304 hartree
correlationener: -1.962379118901 hartree
xcener: -36.132198798205 hartree
chargesum: 1.0000000
charge: -0.193596 0.176773 -0.215611 0.176246 -0.153554 -0.115497 -0.216407 0.160299 0.170592 -0.256071 0.160183 0.176164 -0.143651 0.032016 0.154996 0.169462 0.162623 0.204934 0.181742 0.205238 0.163117
charge: -0.199864 0.170561 -0.194447 0.156643 -0.113841 -0.134474 -0.224920 0.156776 0.162821 -0.198311 0.151913 0.157194 -0.216624 0.139241 0.159347 0.158722 0.164329 0.175105 0.166763 0.206491 0.156575
qa: -0.1936 0.1768 -0.2156 0.1762 -0.1536 -0.1155 -0.2164 0.1603 0.1706 -0.2561 0.1602 0.1762 -0.1437 0.0320 0.1550 0.1695 0.1626 0.2049 0.1817 0.2052 0.1631
va: 3.8969 0.9664 3.8971 0.9674 3.9451 3.9053 3.9380 0.9700 0.9701 3.9538 0.9672 0.9620 3.8946 3.7100 0.9652 0.9704 0.9777 0.9436 0.9673 0.9543 0.9638
dispcorr: -0.018866603 hartree
energy: -312.072898474067
dipole: 0.44462 -0.90552 -0.46090 1.96555 -0.84175 1.12380 0.14883 -0.27171 -0.12287
magnitude: 1.22084 au
magnitude: 3.10313 debye
