program: Orca
programVersion: 5.0.3
elementType: C H C H C C C H H C H H C C H H H H H H H
charge: 1
multiplicity: 1
keywords: DSD-PBEP86 cc-pVTZ EnGrad D3BJ RIJCOSX verytightscf cc-pVTZ/C def2/J soscf
formula: C8H13
InChI: InChI=1/C8H13/c1-2-4-6-8-7-5-3-1/h1-2,7H,3-6,8H2
21 atoms
C  -1.988532 0.663241 0.110941
H  -2.168471 0.854789 1.173318
C  -1.835891 -0.938783 -0.127519
H  -2.647463 -1.438467 0.404418
C  -0.460823 -1.338623 0.387067
C  0.682251 -1.267434 -0.373005
C  1.9903 -0.663297 0.099357
H  2.174522 -0.864584 1.159207
H  2.847697 -1.011216 -0.479604
C  1.837088 0.939035 -0.125473
H  1.934257 1.161892 -1.192754
H  2.647828 1.436986 0.409406
C  0.460952 1.329959 0.395301
C  -0.685187 1.275282 -0.361827
H  0.544876 -1.258348 -1.457886
H  -1.935697 -1.15181 -1.196538
H  0.001485 0.000414 0.069903
H  -0.553743 1.284371 -1.447328
H  -2.849771 1.013061 -0.461097
H  0.348686 1.328201 1.482457
H  -0.346488 -1.354411 1.473981
totalener: -311.07426006 hartree
nucrepener: 382.88822139 hartree
electener: -693.96248145 hartree
oneelecener: -1165.63858877 hartree
twoeener: 471.67610732 hartree
kineticenergy: 309.66663077 hartree
exchangeener: -13.659974331530 hartree
correlationener: -0.927780446040 hartree
xcener: -14.587754777570 hartree
chargesum: 1.0000000
charge: -0.256230 0.173307 -0.259795 0.187185 -0.064164 -0.053336 -0.255898 0.173058 0.186363 -0.259438 0.170677 0.187088 -0.064308 -0.053274 0.184876 0.170850 0.081743 0.185700 0.186403 0.189336 0.189859
charge: 0.109069 -0.003341 0.111744 0.001551 0.134761 0.146216 0.109082 -0.003407 0.002045 0.111837 -0.003863 0.001481 0.134187 0.147510 0.003256 -0.003832 -0.010893 0.003012 0.002111 0.003940 0.003536
qa: -0.2562 0.1733 -0.2598 0.1872 -0.0642 -0.0533 -0.2559 0.1731 0.1864 -0.2594 0.1707 0.1871 -0.0643 -0.0533 0.1849 0.1708 0.0817 0.1857 0.1864 0.1893 0.1899
va: 3.8989 0.9809 3.9053 0.9735 3.8007 3.8053 3.8988 0.9811 0.9738 3.9053 0.9824 0.9736 3.8014 3.8045 0.9827 0.9822 1.1509 0.9823 0.9738 0.9821 0.9817
dispcorr: -0.012001346 hartree
energy: -311.791428060432
dipole: -0.00210 -0.00170 -0.00379 0.00156 0.00007 0.00163 -0.05811 0.04941 -0.00870
magnitude: 0.00963 au
magnitude: 0.02449 debye
