program: Orca
programVersion: 5.0.3
elementType: C H C H C C C H H C H H C C H H H H H H H
charge: 1
multiplicity: 1
keywords: m062x cc-pVTZ EnGrad RIJCOSX verytightscf cc-pVTZ/C def2/J soscf
formula: C8H13
InChI: InChI=1/C8H13/c1-2-4-6-8-7-5-3-1/h1-2,7H,3-6,8H2
21 atoms
C  -1.997597 0.758467 0.071335
H  -2.165969 0.839453 1.148032
C  -1.732194 -0.960571 -0.155077
H  -2.618367 -1.316292 0.375022
C  -0.419301 -1.384283 0.39518
C  0.688008 -1.27887 -0.374111
C  2.002897 -0.6898 0.063608
H  2.212545 -0.883932 1.121154
H  2.856642 -1.03254 -0.526655
C  1.791057 0.866481 -0.142686
H  1.837651 1.123238 -1.206525
H  2.595788 1.412246 0.356606
C  0.421678 1.255266 0.482487
C  -0.767054 1.305825 -0.377363
H  0.524083 -1.206872 -1.454007
H  -1.836727 -1.124015 -1.228095
H  0.173868 0.508873 1.246443
H  -0.656648 1.55299 -1.436767
H  -2.88058 0.987655 -0.523847
H  0.448727 2.177833 1.094674
H  -0.339066 -1.49357 1.476637
totalener: -312.26218668 hartree
nucrepener: 379.70033381 hartree
electener: -691.96252049 hartree
oneelecener: -1160.13747535 hartree
twoeener: 468.17495486 hartree
kineticenergy: 310.02631515 hartree
xcener: -23.083428538109 hartree
chargesum: 1.0000000
charge: -0.320757 0.224129 -0.289180 0.208375 -0.147779 -0.128776 -0.293032 0.178024 0.183846 -0.298235 0.183877 0.186793 -0.264756 0.107726 0.188301 0.210076 0.163639 0.254083 0.208699 0.241275 0.203673
charge: 0.128015 0.013822 0.170561 0.008365 0.017386 0.070157 0.076058 -0.003805 -0.002802 0.104827 -0.011516 -0.000551 0.074614 0.312625 -0.015861 0.000088 0.008956 0.018886 0.006876 0.042681 -0.019384
qa: -0.3208 0.2241 -0.2892 0.2084 -0.1478 -0.1288 -0.2930 0.1780 0.1838 -0.2982 0.1839 0.1868 -0.2648 0.1077 0.1883 0.2101 0.1636 0.2541 0.2087 0.2413 0.2037
va: 3.7411 0.9414 3.7758 0.9482 3.6233 3.6555 3.7764 0.9618 0.9594 3.7352 0.9567 0.9572 3.7194 3.3613 0.9562 0.9469 0.9841 0.9296 0.9558 0.9352 0.9540
energy: -312.262186678292
dipole: 0.14222 -1.02260 -0.88038 1.44662 -0.35413 1.09249 0.41460 -0.52917 -0.11457
magnitude: 1.40773 au
magnitude: 3.57818 debye
