program: Orca
programVersion: 5.0.3
elementType: C H C H C C C H H C H H C C H H H H H H H
charge: 1
multiplicity: 1
keywords: DSD-PBEP86/2013 def2-TZVP RIJCOSX verytightscf def2-TZVP/C def2/J soscf noTRAH
formula: C8H13
InChI: InChI=1/C8H13/c1-2-4-6-8-7-5-3-1/h1-2,7H,3-6,8H2
21 atoms
C  -2.001344 0.727767 0.079537
H  -2.201806 0.871367 1.145006
C  -1.75799 -0.931792 -0.144885
H  -2.618778 -1.358028 0.375334
C  -0.428817 -1.359984 0.407655
C  0.696907 -1.284661 -0.364757
C  2.008421 -0.687173 0.069732
H  2.221754 -0.878894 1.126847
H  2.859162 -1.022698 -0.527471
C  1.800832 0.895471 -0.144384
H  1.859558 1.132296 -1.211893
H  2.614305 1.42458 0.356146
C  0.424322 1.268093 0.441574
C  -0.746108 1.319541 -0.372391
H  0.530591 -1.210112 -1.4440
H  -1.849172 -1.126473 -1.215559
H  0.084493 0.22092 0.797275
H  -0.609477 1.358177 -1.457354
H  -2.869716 0.990636 -0.525399
H  0.371641 1.745746 1.429278
H  -0.34739 -1.517836 1.485213
totalener: -311.09844755 hartree
nucrepener: 381.16451246 hartree
electener: -692.26296000 hartree
oneelecener: -1162.53833130 hartree
twoeener: 470.27537130 hartree
kineticenergy: 309.94710905 hartree
exchangeener: -12.751016567216 hartree
correlationener: -0.946499733284 hartree
xcener: -13.697516300500 hartree
chargesum: 1.0000000
charge: -0.225989 0.181829 -0.275492 0.191203 -0.107220 -0.125148 -0.199059 0.159742 0.170651 -0.321326 0.166566 0.176637 -0.035347 0.041919 0.147356 0.180028 0.064993 0.195363 0.192297 0.230076 0.190921
charge: -0.178570 0.159163 -0.160820 0.158186 -0.202986 -0.095903 -0.207383 0.149099 0.149082 -0.198046 0.144456 0.151252 -0.209608 0.107852 0.153564 0.151204 0.259702 0.171127 0.158620 0.184603 0.155407
qa: -0.2260 0.1818 -0.2755 0.1912 -0.1072 -0.1251 -0.1991 0.1597 0.1707 -0.3213 0.1666 0.1766 -0.0353 0.0419 0.1474 0.1800 0.0650 0.1954 0.1923 0.2301 0.1909
va: 3.8308 0.9677 3.9486 0.9592 3.6744 3.9329 3.8356 0.9722 0.9714 3.9596 0.9642 0.9703 3.5575 3.7259 0.9664 0.9627 1.1082 0.9499 0.9639 0.9474 0.9592
total: -311.791563347 hartree
energy: -311.791563347084
dipole: 0.04235 -0.63860 -0.59624 0.59061 0.24535 0.83596 0.31273 -0.41232 -0.09960
magnitude: 1.03162 au
magnitude: 2.62218 debye
