program: Orca
programVersion: 5.0.3
elementType: C H C H C C C H H C H H C C H H H H H H H
charge: 1
multiplicity: 1
keywords: DSD-PBEP86/2013 def2-TZVP D3BJ RIJCOSX verytightscf def2-TZVP/C def2/J soscf noTRAH
formula: C8H13
InChI: InChI=1/C8H13/c1-2-4-6-8-7-5-3-1/h1-2,7H,3-6,8H2
21 atoms
C  -1.993404 0.603596 0.083962
H  -2.171306 0.772838 1.152428
C  -1.815345 -0.95462 -0.172091
H  -2.646606 -1.474059 0.31352
C  -0.43384 -1.318501 0.357347
C  0.655401 -1.245669 -0.432319
C  1.95231 -0.700648 0.071934
H  2.125386 -0.942651 1.125605
H  2.819561 -1.034548 -0.507901
C  1.819062 0.84633 -0.105991
H  1.858983 1.104574 -1.170345
H  2.648171 1.365491 0.382961
C  0.474541 1.406079 0.508592
C  -0.698092 1.190346 -0.324504
H  0.523862 -1.251838 -1.516823
H  -1.872763 -1.149399 -1.247766
H  0.321928 1.06235 1.534149
H  -0.606561 1.513009 -1.366677
H  -2.828964 0.991391 -0.507084
H  0.619142 2.506734 0.52605
H  -0.316254 -1.364367 1.440921
totalener: -311.14478773 hartree
nucrepener: 380.02021901 hartree
electener: -691.16500674 hartree
oneelecener: -1160.47864998 hartree
twoeener: 469.31364325 hartree
kineticenergy: 310.01728433 hartree
exchangeener: -14.123301333164 hartree
correlationener: -0.943358610878 hartree
xcener: -15.066659944041 hartree
chargesum: 1.0000000
charge: -0.208182 0.177613 -0.213720 0.177286 -0.172305 -0.142923 -0.211678 0.155438 0.165191 -0.251526 0.152230 0.173601 -0.159705 0.105271 0.156516 0.168116 0.162207 0.215407 0.182786 0.203644 0.164731
charge: -0.190878 0.165185 -0.186521 0.151653 -0.125821 -0.139348 -0.219890 0.150039 0.153193 -0.193032 0.144395 0.150562 -0.209578 0.200063 0.152914 0.152665 0.159455 0.175502 0.161163 0.197042 0.151235
qa: -0.2082 0.1776 -0.2137 0.1773 -0.1723 -0.1429 -0.2117 0.1554 0.1652 -0.2515 0.1522 0.1736 -0.1597 0.1053 0.1565 0.1681 0.1622 0.2154 0.1828 0.2036 0.1647
va: 3.8451 0.9653 3.8568 0.9676 3.8705 3.8465 3.8886 0.9724 0.9716 3.8817 0.9697 0.9630 3.8440 3.4946 0.9656 0.9702 0.9787 0.9378 0.9675 0.9547 0.9645
total: -311.795788054 hartree
dispcorr: -0.014171363 hartree
energy: -311.809959416909
dipole: 0.44462 -1.04546 -0.60084 1.96555 -0.65117 1.31438 0.14883 -0.32683 -0.17799
magnitude: 1.45612 au
magnitude: 3.70116 debye
