program: Orca
programVersion: 5.0.3
elementType: C H C H C C C H H C H H C C H H H H H H H
charge: 1
multiplicity: 1
keywords: DSD-PBEP86 cc-pVTZ EnGrad RIJCOSX verytightscf cc-pVTZ/C def2/J soscf
formula: C8H13
InChI: InChI=1/C8H13/c1-3-7-5-2-6-8(4-1)9-7/h3,6-8H,1-2,4-5H2
21 atoms
C  -1.996904 0.672268 0.102554
H  -2.192785 0.863771 1.161999
C  -1.823505 -0.93062 -0.131868
H  -2.64137 -1.433736 0.386931
C  -0.453201 -1.335178 0.396384
C  0.689262 -1.272095 -0.366646
C  2.000022 -0.670989 0.0916
H  2.200267 -0.872694 1.148349
H  2.850593 -1.011541 -0.501594
C  1.826562 0.929808 -0.130732
H  1.909393 1.15166 -1.199472
H  2.641096 1.434601 0.391806
C  0.452183 1.320755 0.402351
C  -0.694014 1.285379 -0.357433
H  0.540392 -1.240623 -1.449896
H  -1.908449 -1.142648 -1.202382
H  0.003058 -0.000902 0.138685
H  -0.55427 1.283148 -1.442118
H  -2.853316 1.010742 -0.483321
H  0.345533 1.342883 1.489906
H  -0.345389 -1.382335 1.482963
totalener: -311.10036067 hartree
nucrepener: 382.84391369 hartree
electener: -693.94427436 hartree
oneelecener: -1165.55775455 hartree
twoeener: 471.61348019 hartree
kineticenergy: 309.66229553 hartree
exchangeener: -12.749198296722 hartree
correlationener: -0.949427144240 hartree
xcener: -13.698625440962 hartree
chargesum: 1.0000000
charge: -0.257685 0.175748 -0.266453 0.188817 -0.069231 -0.049898 -0.257126 0.175201 0.188350 -0.265751 0.172265 0.188643 -0.070182 -0.050852 0.185350 0.172625 0.077658 0.186941 0.188358 0.193033 0.194188
charge: 0.107245 -0.002674 0.112180 0.001785 0.129537 0.150576 0.107234 -0.002763 0.002726 0.112207 -0.003659 0.001623 0.127653 0.152336 0.003825 -0.003583 -0.011478 0.003083 0.002787 0.005057 0.004303
qa: -0.2577 0.1757 -0.2665 0.1888 -0.0692 -0.0499 -0.2571 0.1752 0.1884 -0.2658 0.1723 0.1886 -0.0702 -0.0509 0.1854 0.1726 0.0777 0.1869 0.1884 0.1930 0.1942
va: 3.8965 0.9800 3.9118 0.9729 3.7966 3.8063 3.8960 0.9804 0.9727 3.9119 0.9817 0.9731 3.7988 3.8055 0.9820 0.9814 1.1504 0.9810 0.9727 0.9808 0.9801
energy: -311.816456855282
dipole: -0.00488 -0.00220 -0.00707 0.00282 -0.00444 -0.00162 -0.07285 0.06061 -0.01224
magnitude: 0.01423 au
magnitude: 0.03617 debye
