program: Orca
programVersion: 5.0.3
elementType: C H C H C C C H H C H H C C H H H H H H H
charge: 1
multiplicity: 1
keywords: PBE0 cc-pVTZ EnGrad RIJCOSX verytightscf cc-pVTZ/C def2/J soscf
formula: C8H13
InChI: InChI=1/C8H13/c1-2-4-6-8-7-5-3-1/h1-2,7H,3-6,8H2
21 atoms
C  -1.991048 0.554817 0.109132
H  -2.166798 0.739276 1.173377
C  -1.886703 -0.97704 -0.174874
H  -2.666281 -1.540739 0.343442
C  -0.47578 -1.241375 0.317789
C  0.630345 -1.19228 -0.472859
C  1.921237 -0.677611 0.071885
H  2.053537 -0.948197 1.124791
H  2.788934 -1.039038 -0.488654
C  1.851166 0.878844 -0.071542
H  1.921784 1.149227 -1.131914
H  2.700816 1.34663 0.433757
C  0.52321 1.464864 0.508136
C  -0.62047 1.023555 -0.301356
H  0.531925 -1.304691 -1.55288
H  -1.966973 -1.174136 -1.248672
H  0.389236 1.244379 1.57099
H  -0.491773 1.161998 -1.378865
H  -2.778434 1.039384 -0.47963
H  0.599335 2.563587 0.40027
H  -0.337244 -1.219875 1.40037
totalener: -312.06519921 hartree
nucrepener: 382.19449665 hartree
electener: -694.25969586 hartree
oneelecener: -1165.33676306 hartree
twoeener: 471.07706720 hartree
kineticenergy: 309.63733498 hartree
exchangeener: -34.156555796394 hartree
correlationener: -1.966171530288 hartree
xcener: -36.122727326682 hartree
chargesum: 1.0000000
charge: -0.160777 0.150030 -0.165567 0.153471 -0.085969 -0.112103 -0.176476 0.140671 0.154757 -0.198567 0.138010 0.153796 -0.167717 -0.000669 0.184495 0.143563 0.148044 0.196750 0.158477 0.180658 0.165124
charge: 0.087505 0.004106 0.090814 0.000118 0.114157 0.101967 0.073801 0.000823 0.007375 0.103339 -0.005160 0.000668 0.067371 0.304039 -0.008132 0.001496 0.003630 0.009738 0.008349 0.037934 -0.003939
qa: -0.1608 0.1500 -0.1656 0.1535 -0.0860 -0.1121 -0.1765 0.1407 0.1548 -0.1986 0.1380 0.1538 -0.1677 -0.0007 0.1845 0.1436 0.1480 0.1967 0.1585 0.1807 0.1651
va: 3.8429 0.9923 3.8742 0.9874 3.8172 3.8238 3.8919 0.9938 0.9879 3.8696 0.9900 0.9852 3.8810 3.6439 0.9817 0.9952 0.9925 0.9766 0.9865 0.9785 0.9928
energy: -312.065199210809
dipole: 0.54170 -0.83627 -0.29457 1.88888 -1.27128 0.61760 0.15573 -0.28032 -0.12459
magnitude: 0.69550 au
magnitude: 1.76782 debye
