program: Orca
programVersion: 5.0.3
elementType: C H C H C C C H H C H H C C H H H H H H H
charge: 1
multiplicity: 1
keywords: DSD-PBEP86/2013 cc-pVTZ EnGrad RIJCOSX verytightscf cc-pVTZ/C def2/J soscf
formula: C8H13
InChI: InChI=1/C8H13/c1-2-4-6-8-7-5-3-1/h1-2,7H,3-6,8H2
21 atoms
C  -1.994902 0.613941 0.081506
H  -2.172929 0.777979 1.150831
C  -1.806203 -0.952561 -0.171762
H  -2.64365 -1.463335 0.312556
C  -0.428946 -1.326908 0.361361
C  0.658712 -1.25039 -0.427451
C  1.957176 -0.702784 0.07147
H  2.134742 -0.941793 1.125059
H  2.823917 -1.034199 -0.510576
C  1.815598 0.843005 -0.109183
H  1.85371 1.101016 -1.173579
H  2.641162 1.367692 0.379755
C  0.468111 1.396488 0.507121
C  -0.707295 1.205454 -0.326423
H  0.522584 -1.241817 -1.511707
H  -1.863698 -1.146406 -1.247457
H  0.312193 1.039586 1.527501
H  -0.617819 1.542477 -1.364214
H  -2.835075 0.989432 -0.510219
H  0.614849 2.497091 0.539769
H  -0.314721 -1.38023 1.444807
totalener: -311.14799733 hartree
nucrepener: 379.85044760 hartree
electener: -690.99844493 hartree
oneelecener: -1160.09841160 hartree
twoeener: 469.09996666 hartree
kineticenergy: 309.72135802 hartree
exchangeener: -12.753265234416 hartree
correlationener: -0.943040980560 hartree
xcener: -13.696306214976 hartree
chargesum: 1.0000000
charge: -0.232716 0.186773 -0.240685 0.184859 -0.153510 -0.159876 -0.237701 0.165032 0.179996 -0.248987 0.160106 0.183080 -0.238006 0.078276 0.186594 0.171964 0.174683 0.241799 0.191789 0.215562 0.190969
charge: 0.098666 0.012907 0.103673 0.001345 0.068411 0.050970 0.069625 -0.001979 0.004269 0.113850 -0.008228 -0.000106 0.076992 0.359463 -0.016956 -0.000230 0.006122 0.021639 0.010302 0.047548 -0.018284
qa: -0.2327 0.1868 -0.2407 0.1849 -0.1535 -0.1599 -0.2377 0.1650 0.1800 -0.2490 0.1601 0.1831 -0.2380 0.0783 0.1866 0.1720 0.1747 0.2418 0.1918 0.2156 0.1910
va: 3.8592 0.9765 3.9148 0.9722 3.8325 3.8467 3.9052 0.9851 0.9763 3.8820 0.9824 0.9717 3.9159 3.5163 0.9762 0.9815 0.9863 0.9505 0.9754 0.9644 0.9791
energy: -311.846847897349
dipole: 0.42650 -0.97694 -0.55043 1.97302 -0.72300 1.25003 0.15210 -0.28885 -0.13675
magnitude: 1.37268 au
magnitude: 3.48907 debye
