program: Orca
programVersion: 5.0.3
elementType: C H C H C C C H H C H H C C H H H H H H H
charge: 1
multiplicity: 1
keywords: DSD-PBEP86/2013 cc-pVTZ EnGrad D3BJ RIJCOSX verytightscf cc-pVTZ/C def2/J soscf
formula: C8H13
InChI: InChI=1/C8H13/c1-2-4-6-8-7-5-3-1/h1-2,7H,3-6,8H2
21 atoms
C  -2.001526 0.683085 0.073948
H  -2.177148 0.792327 1.148996
C  -1.760842 -0.962024 -0.172013
H  -2.630623 -1.398729 0.32691
C  -0.412113 -1.363819 0.375976
C  0.670936 -1.265213 -0.406151
C  1.979287 -0.707771 0.067492
H  2.171943 -0.934104 1.121385
H  2.842533 -1.037132 -0.519618
C  1.799836 0.831751 -0.121115
H  1.83386 1.092782 -1.184755
H  2.610917 1.375829 0.37035
C  0.4425 1.349196 0.500277
C  -0.746418 1.261009 -0.335913
H  0.515765 -1.198539 -1.487283
H  -1.835842 -1.1413 -1.247283
H  0.267383 0.932158 1.493932
H  -0.651414 1.620099 -1.365599
H  -2.862765 0.990204 -0.522123
H  0.573359 2.448711 0.61797
H  -0.315027 -1.434675 1.45913
totalener: -311.13314506 hartree
nucrepener: 379.19106155 hartree
electener: -690.32420661 hartree
oneelecener: -1158.81195360 hartree
twoeener: 468.48774699 hartree
kineticenergy: 309.72328810 hartree
exchangeener: -14.118289688686 hartree
correlationener: -0.942432013701 hartree
xcener: -15.060721702388 hartree
chargesum: 1.0000000
charge: -0.247846 0.193974 -0.238479 0.190238 -0.163016 -0.145968 -0.232160 0.159652 0.175383 -0.247941 0.157511 0.178966 -0.235963 0.099583 0.168225 0.180056 0.170078 0.241218 0.196400 0.212314 0.187777
charge: 0.119108 0.014335 0.142313 0.002905 0.037796 0.046110 0.070141 -0.003464 0.000555 0.111863 -0.009906 -0.000975 0.082869 0.341038 -0.018669 -0.001958 0.006054 0.023674 0.008069 0.050459 -0.022316
qa: -0.2478 0.1940 -0.2385 0.1902 -0.1630 -0.1460 -0.2322 0.1597 0.1754 -0.2479 0.1575 0.1790 -0.2360 0.0996 0.1682 0.1801 0.1701 0.2412 0.1964 0.2123 0.1878
va: 3.8691 0.9741 3.9086 0.9697 3.8196 3.8465 3.8996 0.9867 0.9774 3.8831 0.9834 0.9731 3.9165 3.5149 0.9822 0.9772 0.9895 0.9512 0.9756 0.9656 0.9801
dispcorr: -0.014123262 hartree
energy: -311.818214969401
dipole: 0.32115 -1.07532 -0.75418 1.97318 -0.62762 1.34556 0.19851 -0.34012 -0.14161
magnitude: 1.54899 au
magnitude: 3.93721 debye
