program: Gaussian 09
title: 000050793
version: EM64L-G09RevD.01
frameworkgroup: C1[X(C17H26N2O2)]
method: RPBEPBE
basis: SDD
operation: Freq
keyword: #p
keyword: freq=noraman
keyword: PBEPBE/SDD
title: #p freq=noraman PBEPBE/SDD
converged: YES YES NO NO
title: Mulliken charges:
elementType: O O N N C C C C C C C C C C C C C C C C C H H H H H H H H H H H H H H H H H H H H H H H H H H
charge: -0.294893 -0.269564 -0.129268 -0.684879 0.064382 -0.464203 -0.435127 -0.414084 -0.398131 -0.383926 -0.459360 -0.313277 -0.275299 -0.715574 0.179226 0.225081 -0.335591 -0.325092 -0.406388 -0.400573 0.499875 0.162908 0.212581 0.202496 0.190369 0.206040 0.198381 0.193840 0.191900 0.197239 0.190614 0.196531 0.246764 0.237947 0.180584 0.204835 0.235321 0.234752 0.214105 0.228990 0.218731 0.265067 0.265197 0.220886 0.219364 0.310428 0.310796
chargesum: 0.00000
title: Mulliken charges with hydrogens summed into heavy atoms:
elementType: O O N N C C C C C C C C C C C C C C C C C
charge: -0.294893 -0.269564 -0.129268 -0.063655 0.227290 -0.049126 -0.038718 -0.021864 -0.008993 0.003219 0.025350 0.072143 0.194774 -0.053748 0.179226 0.225081 -0.070523 -0.059895 -0.185502 -0.181209 0.499875
polarizability: 2.99734256e+02 -1.97312786e+01 1.63738985e+02 -1.74289582e+01 6.18268755e+00 1.82775902e+02
1716.lowfreq: -11.1501 -0.0011 -0.0008 -0.0006 4.2854 5.8379 14.8529 19.1394 29.3679
frequency: 14.5842 17.8330 28.9198 49.5640 51.1228 57.9161 88.3437 100.0858 120.1493 131.4115 168.7797 199.5839 211.5188 218.9634 228.6649 280.4617 291.8798 309.7819 328.1123 335.3952 341.4969 366.0205 391.2813 407.6601 411.4805 415.9337 432.8335 444.7793 463.0014 479.4740 508.1529 529.2762 575.0610 607.0959 633.8806 677.2325 754.5617 755.1460 769.2463 779.0817 785.3687 803.4417 813.4650 824.3667 828.6696 843.2510 853.1515 884.9356 895.4565 923.6956 929.4589 946.0567 973.5435 983.1865 996.2634 998.6969 1017.5944 1031.2628 1044.7718 1049.4303 1054.6916 1058.8637 1068.0505 1079.0674 1106.5121 1113.8269 1130.2478 1143.1454 1152.4556 1170.4404 1179.8762 1211.9978 1227.5512 1244.1377 1251.0369 1252.9018 1260.4936 1281.0013 1300.6029 1307.8104 1309.2496 1310.9039 1316.7640 1325.9211 1333.7094 1339.9059 1342.0297 1345.7633 1365.1475 1369.1847 1380.8472 1387.7858 1391.7937 1447.7584 1458.2990 1462.5118 1463.1234 1466.0291 1469.9567 1474.9029 1477.2754 1482.3928 1492.6101 1501.6552 1516.9677 1570.2948 1612.2375 1631.7800 1646.3356 2815.3200 2847.7744 2963.6666 2966.8927 2968.3050 2969.7318 2982.4650 2983.2547 2999.7498 3026.1745 3026.8284 3027.8660 3036.0224 3038.1750 3042.7013 3050.1165 3056.4747 3077.5415 3086.3157 3089.3194 3123.2020 3125.9829 3158.4317 3173.0237 3560.8686 3700.7237
redmass: 4.6080 4.0859 3.1238 3.9494 3.4052 3.5084 6.5777 3.0101 3.4472 2.9733 2.8384 3.5141 1.7020 2.7402 1.9316 1.9351 4.8551 3.1379 3.5583 4.7249 2.1803 3.1796 2.4308 1.1489 1.2789 2.1118 2.8664 3.1212 3.5612 1.6961 2.8314 3.1259 2.7274 6.4013 6.9057 3.9902 3.4050 3.9236 1.2042 3.1694 1.4543 1.2187 3.4475 1.2652 5.1686 1.8474 1.8406 1.8724 1.4019 2.9438 3.8067 2.2221 1.3628 1.3520 2.5206 2.7663 1.4803 3.7763 2.1652 1.3851 4.5164 1.8589 1.6791 1.6950 1.7589 2.3171 1.2156 2.1786 1.8252 1.5393 1.1399 2.0293 1.4198 1.3918 2.6905 1.2708 1.2474 1.1911 1.1607 1.3260 1.2506 1.3101 1.3027 2.9630 1.4202 1.5033 1.4694 1.4927 1.4008 1.3425 1.3486 1.2998 4.7920 4.2182 1.0832 1.0833 1.0887 1.0665 1.0800 1.0733 1.0748 1.0648 1.0826 1.0722 3.1940 7.2912 10.2793 3.2431 1.4377 1.0804 1.0727 1.0629 1.0609 1.0652 1.0619 1.0608 1.0368 1.0568 1.0934 1.0755 1.0871 1.0985 1.0941 1.0962 1.1000 1.1033 1.0979 1.1006 1.1021 1.0894 1.0893 1.0953 1.0949 1.0450 1.1040
irintensity: 1.4868 0.3733 0.3002 1.5233 0.9617 1.8202 0.0353 1.5286 0.1327 1.1170 1.1725 0.2329 0.9275 0.9807 0.2914 1.4001 10.2017 3.7519 11.9381 0.0603 4.6367 1.1687 7.2098 102.4486 206.2350 5.7179 1.2193 1.7382 10.0772 0.8218 3.1189 5.5603 6.1669 11.9591 1.6893 26.6465 3.2104 11.9265 4.1530 11.6205 0.6013 12.7588 3.6596 0.6699 6.5022 73.0214 14.9018 0.3089 9.1460 6.0917 7.3018 7.1476 0.1752 0.1323 10.9538 28.9247 16.4184 7.1594 36.6437 9.2156 428.4686 15.1255 23.3387 4.3582 9.7652 0.5226 14.0844 6.2457 10.0609 33.2015 191.6629 31.0452 5.3059 9.9660 335.0385 7.3130 3.8338 14.3009 4.7287 5.8955 0.4933 3.7145 1.4064 127.2426 2.9024 5.5089 2.5090 1.3193 13.4318 33.2076 7.7437 13.4082 12.5667 6.6189 5.9730 9.6031 4.8902 5.7957 21.2711 6.7302 18.4588 2.4863 14.8609 5.7336 67.6903 28.4970 345.2497 99.0668 326.9778 53.0166 101.2179 43.3702 33.6499 39.5226 19.2783 37.6862 19.1498 22.3329 56.2718 86.1587 45.7997 23.4092 6.0964 59.5244 85.5951 13.5135 86.6657 25.4738 42.4533 15.3493 23.1619 9.7358 3.7862 113.1811 23.0606
temp: 298.150 k
press: 1.00000 atm
elementType: 8 8 7 7 6 6 6 6 6 6 6 6 6 6 6 6 6 6 6 6 6 1 1 1 1 1 1 1 1 1 1 1 1 1 1 1 1 1 1 1 1 1 1 1 1 1 1
symmnumber: 1
zpe: 1062203.8 jmol-1
zpe.correction: 0.404572 hartree
zpe.thermalcorrener: 0.426230 hartree
zpe.thermalcorrenthalpy: 0.427174 hartree
zpe.thermalcorrgfe: 0.351155 hartree
zpe.sumelectzpe: -921.739443 hartree
zpe.sumelectthermal: -921.717785 hartree
zpe.sumelectthermalent: -921.716841 hartree
zpe.sumelectthermalfe: -921.792860 hartree
dipole: 3.1661 -1.2016 -2.4106
dipole: 4.1568
quadrupole: -78.9334 -127.8497 -128.9660
quadrupole: -8.9772 -13.1275 1.5170
quadrupole: 32.9830 -15.9334 -17.0496 -8.9772 -13.1275 1.5170
hfenergy: -922.1440149 hartree
pointgroup: C01 [X(C17H26N2O2)]
dipole: 1.2265953 0.4799758 0.9693387 debye
polarizability: 298.8404627|20.5970786|164.0128549|19.3016383|6.6064948|183.3958252 unknown
InChI: InChI=1S/C17H26N2O2/c1-2-19(16-6-4-3-5-7-16)12-13-21-17(20)14-8-10-15(18)11-9-14/h8-11,16H,2-7,12-13,18H2,1H3
charge 0 multiplicity 1
47 atoms
O  0.886398 -0.534563 0.018542
O  1.643672 -0.554256 -2.189213
N  -2.822032 -1.131296 0.502568
N  7.035892 0.922822 1.155811
C  -3.570544 0.023265 -0.10351
C  -3.025199 1.405506 0.340103
C  -5.076583 -0.056928 0.277794
C  -3.837066 2.566129 -0.286206
C  -5.902208 1.092493 -0.347547
C  -5.339305 2.47249 0.060203
C  -1.378588 -0.934117 0.767237
C  -3.13544 -2.424701 -0.166271
C  -0.475633 -0.849979 -0.485429
C  -2.626588 -3.660862 0.599991
C  1.887047 -0.401192 -0.962785
C  3.202954 -0.065079 -0.377675
C  4.311456 0.107687 -1.251329
C  3.40265 0.097515 1.020792
C  5.579852 0.433265 -0.751939
C  4.667781 0.423157 1.531734
C  5.780695 0.598023 0.653163
H  -3.501246 -0.015342 -1.224429
H  -1.963681 1.526907 0.055476
H  -3.078834 1.47075 1.446549
H  -5.509123 -1.02564 -0.033611
H  -5.142796 -0.016826 1.383447
H  -3.42095 3.532656 0.058601
H  -3.714837 2.542289 -1.389102
H  -5.881864 1.002071 -1.453845
H  -6.962004 1.000257 -0.040201
H  -5.472376 2.613018 1.152791
H  -5.901186 3.284442 -0.441163
H  -1.238733 -0.016225 1.360466
H  -1.021229 -1.763561 1.402449
H  -2.751284 -2.456688 -1.218364
H  -4.233824 -2.502601 -0.241955
H  -0.792796 -0.051164 -1.181268
H  -0.43458 -1.798585 -1.051249
H  -3.0247 -4.580253 0.132653
H  -2.968536 -3.626607 1.649926
H  -1.524724 -3.741061 0.596208
H  4.149129 -0.018819 -2.327095
H  2.552591 -0.034651 1.696116
H  6.424611 0.563977 -1.43908
H  4.808038 0.54578 2.612659
H  7.183936 1.040745 2.154099
H  7.829986 1.048552 0.534488
