program: Orca
programVersion: 5.0.3
elementType: C H C H C C C H H C H H C C H H H H H H H
charge: 1
multiplicity: 1
keywords: DSD-PBEP86/2013 cc-pVTZ EnGrad RIJCOSX verytightscf cc-pVTZ/C def2/J soscf
formula: C8H13
InChI: InChI=1/C8H13/c1-2-4-6-8-7-5-3-1/h1-2,7H,3-6,8H2
21 atoms
C  -1.992658 0.518455 0.066205
H  -2.1986 0.793136 1.103992
C  -2.000152 -1.023477 -0.116059
H  -2.679226 -1.575313 0.534409
C  -0.542511 -1.084204 0.292673
C  0.570393 -1.057694 -0.529986
C  1.901372 -0.628049 0.011931
H  2.027072 -1.005262 1.032527
H  2.717128 -1.019914 -0.600718
C  1.936927 0.939082 0.02582
H  2.147005 1.304621 -0.985456
H  2.748021 1.285915 0.671146
C  0.567429 1.467891 0.492633
C  -0.490223 0.70709 -0.263989
H  0.463853 -1.274052 -1.591945
H  -2.159845 -1.321031 -1.155957
H  0.430131 1.368207 1.574741
H  -0.36265 0.802997 -1.345656
H  -2.646776 1.086313 -0.600321
H  0.469461 2.534391 0.247895
H  -0.361092 -1.025815 1.366453
totalener: -311.18279769 hartree
nucrepener: 387.55454735 hartree
electener: -698.73734504 hartree
oneelecener: -1175.27906186 hartree
twoeener: 476.54171683 hartree
kineticenergy: 309.75645441 hartree
exchangeener: -12.764591568863 hartree
correlationener: -0.949943279243 hartree
xcener: -13.714534848106 hartree
chargesum: 1.0000000
charge: -0.215683 0.171642 -0.245789 0.186467 -0.036003 -0.044431 -0.256106 0.167900 0.183158 -0.252255 0.164774 0.181314 -0.241580 -0.096937 0.226328 0.171731 0.160060 0.194747 0.183961 0.192543 0.204160
charge: 0.109754 0.000301 0.109026 -0.000350 0.127126 0.179918 0.086004 0.002888 0.006320 0.095892 -0.006135 -0.000142 0.066333 0.184824 0.006378 -0.000100 -0.003802 0.005310 -0.002044 0.015631 0.016867
qa: -0.2157 0.1716 -0.2458 0.1865 -0.0360 -0.0444 -0.2561 0.1679 0.1832 -0.2523 0.1648 0.1813 -0.2416 -0.0969 0.2263 0.1717 0.1601 0.1947 0.1840 0.1925 0.2042
va: 3.8667 0.9847 3.8897 0.9768 3.7783 3.7661 3.9224 0.9812 0.9765 3.8956 0.9800 0.9736 3.8927 3.7786 0.9590 0.9844 0.9845 0.9820 0.9745 0.9676 0.9764
energy: -311.886829444760
dipole: 0.55710 -0.71951 -0.16241 1.82922 -1.94339 -0.11417 0.23518 -0.40373 -0.16855
magnitude: 0.26042 au
magnitude: 0.66195 debye
