program: Orca
programVersion: 5.0.3
elementType: C H C H C C C H H C H H C C H H H H H H H
charge: 1
multiplicity: 1
keywords: b3lyp def2-TZVP EnGrad RIJCOSX verytightscf def2/J soscf
formula: C8H13
InChI: InChI=1/C8H13/c1-2-4-6-8-7-5-3-1/h1-2,7H,3-6,8H2
21 atoms
C  -1.991619 0.590989 0.088068
H  -2.169156 0.765253 1.155524
C  -1.828338 -0.958676 -0.172799
H  -2.65079 -1.488194 0.316629
C  -0.441167 -1.30616 0.351028
C  0.650468 -1.237989 -0.439544
C  1.945431 -0.697082 0.072393
H  2.111469 -0.943655 1.126181
H  2.813346 -1.035306 -0.503783
C  1.82421 0.851541 -0.100849
H  1.867491 1.110725 -1.164976
H  2.658257 1.362185 0.388805
C  0.483966 1.419343 0.510301
C  -0.684413 1.166089 -0.321457
H  0.525492 -1.2655 -1.524017
H  -1.887479 -1.154435 -1.248318
H  0.335663 1.096117 1.543375
H  -0.587903 1.46199 -1.37108
H  -2.820119 0.996253 -0.502118
H  0.622373 2.520184 0.505548
H  -0.319099 -1.339679 1.434744
totalener: -312.23047246 hartree
nucrepener: 380.29593856 hartree
electener: -692.52641102 hartree
oneelecener: -1161.65321161 hartree
twoeener: 469.12680059 hartree
kineticenergy: 310.52519828 hartree
exchangeener: -36.322813653003 hartree
correlationener: -2.304032287009 hartree
xcener: -38.626845940012 hartree
chargesum: 1.0000000
charge: -0.183557 0.163417 -0.198505 0.164604 -0.123101 -0.086396 -0.207448 0.148478 0.159392 -0.227535 0.146501 0.162998 -0.122343 0.039935 0.149077 0.155066 0.149005 0.198078 0.169211 0.189369 0.153755
charge: -0.195836 0.164831 -0.191353 0.152877 -0.098895 -0.122713 -0.216982 0.153199 0.159817 -0.192471 0.148151 0.153694 -0.211431 0.136312 0.156626 0.154860 0.159468 0.171772 0.163172 0.200299 0.154602
qa: -0.1836 0.1634 -0.1985 0.1646 -0.1231 -0.0864 -0.2074 0.1485 0.1594 -0.2275 0.1465 0.1630 -0.1223 0.0399 0.1491 0.1551 0.1490 0.1981 0.1692 0.1894 0.1538
va: 3.8361 0.9668 3.8315 0.9684 3.8385 3.8021 3.8868 0.9697 0.9702 3.8598 0.9676 0.9639 3.8190 3.5850 0.9672 0.9714 0.9791 0.9457 0.9684 0.9571 0.9664
energy: -312.230472459209
dipole: 0.46804 -0.88587 -0.41783 1.95280 -0.93512 1.01768 0.14647 -0.26864 -0.12217
magnitude: 1.10688 au
magnitude: 2.81347 debye
