program: Orca
programVersion: 5.0.3
elementType: C H C H C C C H H C H H C C H H H H H H H
charge: 1
multiplicity: 1
keywords: DSD-PBEP86 def2-TZVP RIJCOSX verytightscf def2-TZVP/C def2/J soscf noTRAH
formula: C8H13
InChI: InChI=1/C8H13/c1-2-4-6-8-7-5-3-1/h1-2,7H,3-6,8H2
21 atoms
C  -1.99778 0.528988 0.119815
H  -2.175937 0.722721 1.181077
C  -1.958015 -0.998063 -0.169806
H  -2.676103 -1.59163 0.398134
C  -0.519346 -1.136076 0.281257
C  0.609477 -1.120939 -0.504701
C  1.906967 -0.650818 0.064379
H  2.006436 -0.952499 1.112471
H  2.761274 -1.04496 -0.492599
C  1.896647 0.914378 -0.034582
H  2.024853 1.208304 -1.082965
H  2.743524 1.32684 0.520124
C  0.558315 1.481307 0.489557
C  -0.546097 0.81815 -0.262587
H  0.530192 -1.299242 -1.576661
H  -2.074265 -1.208557 -1.237012
H  0.442459 1.361496 1.57165
H  -0.421125 0.881866 -1.346495
H  -2.713954 1.099968 -0.479528
H  0.521039 2.560947 0.272778
H  -0.369002 -1.08506 1.360873
totalener: -311.18150013 hartree
nucrepener: 385.59551521 hartree
electener: -696.77701533 hartree
oneelecener: -1171.45444789 hartree
twoeener: 474.67743256 hartree
kineticenergy: 310.01627697 hartree
exchangeener: -12.763486914487 hartree
correlationener: -0.948387803019 hartree
xcener: -13.711874717506 hartree
chargesum: 1.0000000
charge: -0.201661 0.164856 -0.199397 0.178722 -0.083051 -0.064174 -0.225091 0.159253 0.176955 -0.237589 0.152419 0.174203 -0.207856 -0.025061 0.203205 0.160331 0.151928 0.183582 0.176213 0.182451 0.179761
charge: -0.191404 0.153068 -0.185754 0.149499 -0.061525 -0.022380 -0.205878 0.154467 0.156871 -0.206578 0.146271 0.150573 -0.223921 0.050079 0.164815 0.152072 0.151728 0.171521 0.151466 0.173931 0.171080
qa: -0.2017 0.1649 -0.1994 0.1787 -0.0831 -0.0642 -0.2251 0.1593 0.1770 -0.2376 0.1524 0.1742 -0.2079 -0.0251 0.2032 0.1603 0.1519 0.1836 0.1762 0.1825 0.1798
va: 3.8677 0.9737 3.8684 0.9721 3.8489 3.8054 3.9045 0.9687 0.9684 3.8716 0.9715 0.9667 3.9192 3.7064 0.9470 0.9740 0.9725 0.9551 0.9708 0.9653 0.9603
total: -311.866176395 hartree
energy: -311.866176394579
dipole: 0.56170 -0.75946 -0.19775 1.85360 -1.73551 0.11809 0.18900 -0.37562 -0.18661
magnitude: 0.29644 au
magnitude: 0.75349 debye
