program: Orca
programVersion: 5.0.3
elementType: C H C H C C C H H C H H C C H H H H H H H
charge: 1
multiplicity: 1
keywords: PBE0 cc-pVTZ EnGrad RIJCOSX verytightscf cc-pVTZ/C def2/J soscf
formula: C8H13
InChI: InChI=1/C8H13/c1-2-4-6-8-7-5-3-1/h1-2,7H,3-6,8H2
21 atoms
C  -2.001526 0.683085 0.073948
H  -2.177148 0.792327 1.148996
C  -1.760842 -0.962024 -0.172013
H  -2.630623 -1.398729 0.32691
C  -0.412113 -1.363819 0.375976
C  0.670936 -1.265213 -0.406151
C  1.979287 -0.707771 0.067492
H  2.171943 -0.934104 1.121385
H  2.842533 -1.037132 -0.519618
C  1.799836 0.831751 -0.121115
H  1.83386 1.092782 -1.184755
H  2.610917 1.375829 0.37035
C  0.4425 1.349196 0.500277
C  -0.746418 1.261009 -0.335913
H  0.515765 -1.198539 -1.487283
H  -1.835842 -1.1413 -1.247283
H  0.267383 0.932158 1.493932
H  -0.651414 1.620099 -1.365599
H  -2.862765 0.990204 -0.522123
H  0.573359 2.448711 0.61797
H  -0.315027 -1.434675 1.45913
totalener: -312.04149501 hartree
nucrepener: 379.19106155 hartree
electener: -691.23255656 hartree
oneelecener: -1159.41568183 hartree
twoeener: 468.18312527 hartree
kineticenergy: 309.63467041 hartree
exchangeener: -34.148261425452 hartree
correlationener: -1.960162568004 hartree
xcener: -36.108423993456 hartree
chargesum: 1.0000000
charge: -0.184221 0.170649 -0.179326 0.162104 -0.151918 -0.126554 -0.168416 0.137268 0.149208 -0.196669 0.137949 0.152002 -0.184864 0.099725 0.144261 0.158411 0.151296 0.209951 0.172370 0.186829 0.159944
charge: 0.118777 0.015259 0.140193 0.003138 0.037434 0.046102 0.070037 -0.001783 0.002434 0.112292 -0.008056 0.000348 0.082983 0.329591 -0.017128 -0.000723 0.007655 0.022188 0.008577 0.052489 -0.021807
qa: -0.1842 0.1706 -0.1793 0.1621 -0.1519 -0.1266 -0.1684 0.1373 0.1492 -0.1967 0.1379 0.1520 -0.1849 0.0997 0.1443 0.1584 0.1513 0.2100 0.1724 0.1868 0.1599
va: 3.8413 0.9848 3.8838 0.9825 3.8139 3.8384 3.8796 0.9947 0.9883 3.8664 0.9911 0.9854 3.8971 3.5395 0.9932 0.9870 0.9975 0.9696 0.9863 0.9786 0.9933
energy: -312.041495011093
dipole: 0.32115 -1.02743 -0.70628 1.97318 -0.64475 1.32843 0.19851 -0.32699 -0.12848
magnitude: 1.50999 au
magnitude: 3.83809 debye
