program: Gaussian 09
title: 000002275
version: EM64L-G09RevD.01
frameworkgroup: C1[X(C15H18O3S)]
method: RPBEPBE
basis: SDD
operation: Freq
keyword: #p
keyword: freq=noraman
keyword: PBEPBE/SDD
title: #p freq=noraman PBEPBE/SDD
converged: YES YES NO NO
title: Mulliken charges:
elementType: S O O O C C C C C C C C C C C C C C C H H H H H H H H H H H H H H H H H H
charge: 0.958497 -0.573001 -0.510901 -0.514008 0.258795 0.433929 0.656671 -0.440306 -0.273580 0.203670 -0.570854 0.350448 -0.441141 -0.435607 -0.421564 -0.690296 -0.688931 -0.826613 -0.856316 0.214016 0.237831 0.301887 0.213641 0.203752 0.210102 0.231376 0.220829 0.230690 0.210965 0.220721 0.232162 0.233211 0.249041 0.286018 0.222343 0.288985 0.373540
chargesum: 0.00000
title: Mulliken charges with hydrogens summed into heavy atoms:
elementType: S O O O C C C C C C C C C C C C C C C
charge: 0.958497 -0.199461 -0.510901 -0.514008 0.258795 0.433929 0.656671 -0.440306 -0.059565 0.203670 -0.333023 0.350448 -0.139254 -0.221966 -0.217813 -0.027989 -0.026556 -0.112199 -0.058971
polarizability: 3.22157451e+02 -1.46722253e+01 2.30005460e+02 -9.32057603e-01 6.09386287e-01 1.21427983e+02
1716.lowfreq: -11.2097 -1.0557 -0.0013 0.0007 0.0014 8.2133 28.5362 30.3984 69.6505
frequency: 28.1447 30.3131 69.6032 87.8912 121.6547 125.1622 131.4108 140.0852 150.5382 171.6134 195.2208 203.6225 212.5629 224.1102 235.5894 239.1322 248.5040 267.9360 286.8816 299.3229 307.8705 337.2299 373.9601 386.3753 388.0399 399.6300 414.8037 453.0506 473.6665 514.4781 544.3442 552.0506 582.8834 638.3546 659.4598 665.5748 703.9817 785.6898 810.1496 840.4623 842.2600 861.2857 896.4393 896.7283 917.7572 945.1493 952.7587 957.5723 969.8935 977.3237 993.9843 1018.4029 1033.6469 1042.5694 1051.0460 1062.5935 1100.7647 1110.7849 1122.5604 1140.2785 1197.6656 1225.0916 1260.4856 1288.2591 1304.8098 1311.5346 1351.5856 1377.0388 1380.9653 1393.1733 1400.1291 1403.3678 1415.7627 1431.2568 1453.8332 1465.9921 1468.0097 1469.0960 1474.1607 1478.2716 1481.0501 1485.7604 1496.5347 1529.0195 1553.9026 1573.5689 1621.8391 2968.9640 2975.2695 2977.2508 2977.5485 2986.7589 3040.8786 3054.1707 3067.3228 3074.1524 3080.0540 3083.5213 3084.4476 3085.9295 3096.5926 3099.2803 3118.1876 3205.1512 3476.5817
redmass: 2.7477 5.1000 5.6788 3.9853 3.8770 1.4081 2.5211 3.0392 3.1482 1.6540 3.0052 2.0373 1.9495 1.5948 1.2923 1.4407 3.3422 3.2376 2.9390 4.3817 5.0323 6.4736 3.7181 3.7891 4.1819 4.3118 4.5203 6.5812 3.6471 7.3746 3.4711 3.9669 3.6281 3.3723 3.0734 5.1403 3.9181 5.5817 11.2612 4.3520 1.6263 3.4267 1.3293 2.7351 1.1849 8.0305 1.5898 1.3688 2.4194 3.3707 1.3762 1.6925 1.2004 1.5011 1.5852 1.8531 2.1437 2.5654 1.7912 1.9745 2.3936 2.8507 2.2451 2.3704 1.3374 1.9746 1.7774 1.5519 1.2004 3.1198 1.2682 1.2289 1.2551 2.4937 2.4634 1.0474 1.0475 1.0747 1.0451 1.1773 1.0705 1.0691 1.1516 3.1885 5.3653 7.8779 5.7253 1.0386 1.0353 1.0379 1.0361 1.0840 1.0978 1.0961 1.0997 1.0985 1.1007 1.0972 1.0889 1.0966 1.0986 1.0866 1.0907 1.0972 1.0660
irintensity: 0.0244 0.3533 0.3445 0.0782 4.0032 0.7424 1.9320 1.0159 8.0370 34.0735 4.0578 0.9801 2.4350 4.2020 3.4281 11.1142 7.2310 8.4286 0.4504 23.3820 22.4556 6.3314 7.0446 5.4648 5.8637 4.0964 20.2097 68.2471 2.3843 182.9909 3.3666 41.7685 1.9579 4.8546 17.8489 3.1828 0.2052 0.7200 45.8433 41.4342 34.1905 6.5580 15.1836 11.1421 4.4701 85.5293 2.0924 6.9533 15.0554 7.4524 0.0155 12.6996 103.9039 1.6763 8.4426 27.1115 17.9407 1.2329 50.7394 11.1051 4.8779 11.7952 21.3762 19.6635 1.4145 39.6363 1.0765 31.1239 16.1779 62.2824 18.0763 7.2308 21.0057 27.4136 3.0647 0.2768 8.4720 20.6368 13.0660 6.0953 41.1487 17.9110 23.3728 35.5994 14.1780 46.4039 5.2075 37.1791 26.7583 11.7494 31.5075 15.2597 20.6145 0.4348 2.9333 88.1512 19.6732 52.8908 20.8988 10.3042 11.3647 20.3182 34.5271 5.4031 33.7971
temp: 298.150 k
press: 1.00000 atm
elementType: 16 8 8 8 6 6 6 6 6 6 6 6 6 6 6 6 6 6 6 1 1 1 1 1 1 1 1 1 1 1 1 1 1 1 1 1 1
symmnumber: 1
zpe: 765247.4 jmol-1
zpe.correction: 0.291467 hartree
zpe.thermalcorrener: 0.311955 hartree
zpe.thermalcorrenthalpy: 0.312899 hartree
zpe.thermalcorrgfe: 0.242949 hartree
zpe.sumelectzpe: -1204.517908 hartree
zpe.sumelectthermal: -1204.497421 hartree
zpe.sumelectthermalent: -1204.496477 hartree
zpe.sumelectthermalfe: -1204.566426 hartree
dipole: 7.3810 -1.0533 1.3549
dipole: 7.5779
quadrupole: -122.1577 -110.3840 -128.5547
quadrupole: 4.7707 -8.8943 -1.8342
quadrupole: -1.7922 9.9814 -8.1892 4.7707 -8.8943 -1.8342
hfenergy: -1204.8093756 hartree
pointgroup: C01 [X(C15H18O3S1)]
dipole: -2.9031621 0.3182136 0.5991047 debye
polarizability: 322.9276032|-11.7544307|229.178503|-3.5261548|0.6859444|121.4847881 unknown
InChI: InChI=1S/C15H18O3S/c1-9(2)12-6-5-10(3)15-13(8-12)11(4)7-14(15)19(16,17)18/h5-9,16H,1-4H3
charge 0 multiplicity 1
37 atoms
S  3.588294 -0.040239 -0.234604
O  3.862143 0.753861 1.454731
O  3.898409 1.090102 -1.357025
O  4.467535 -1.401355 -0.276609
C  -0.458704 -0.798287 0.041259
C  0.618027 0.25807 -0.01063
C  -2.678046 0.496385 0.057461
C  1.828405 -0.503973 -0.061147
C  -4.204027 0.30175 0.069793
C  0.168992 -2.096942 0.049913
C  -1.858771 -0.655958 0.067317
C  0.418041 1.668472 0.035658
C  1.559016 -1.905671 -0.008389
C  -2.177645 1.821504 0.051196
C  -0.854089 2.311036 0.05647
C  -4.699363 -0.471892 -1.181501
C  -4.683963 -0.387978 1.375538
C  -0.531058 -3.432762 0.101255
C  1.613169 2.600266 0.079981
H  -4.665916 1.308391 0.0394
H  -2.397297 -1.614309 0.092055
H  2.327552 -2.679316 -0.025871
H  -2.947245 2.607899 0.054661
H  -0.791303 3.407011 0.078791
H  -4.298399 -1.502532 -1.204183
H  -4.389726 0.032324 -2.114367
H  -5.802463 -0.543422 -1.17622
H  -4.368837 0.180034 2.269129
H  -4.275281 -1.412028 1.46391
H  -5.786603 -0.4662 1.385677
H  -1.202808 -3.584038 -0.765691
H  -1.142924 -3.546181 1.016827
H  0.204171 -4.254671 0.093627
H  2.288464 2.340121 0.916227
H  1.295479 3.648229 0.196912
H  2.22536 2.519205 -0.837173
H  4.837209 0.976892 1.505119
