program: Orca
programVersion: 5.0.3
elementType: C H C H C C C H H C H H C C H H H H H H H
charge: 1
multiplicity: 1
keywords: DSD-PBEP86/2013 cc-pVTZ EnGrad RIJCOSX verytightscf cc-pVTZ/C def2/J soscf
formula: C8H13
InChI: InChI=1/C8H13/c1-2-4-6-8-7-5-3-1/h1-2,7H,3-6,8H2
21 atoms
C  -2.002804 0.70954 0.072017
H  -2.175679 0.796196 1.148561
C  -1.747209 -0.969852 -0.171016
H  -2.626102 -1.375045 0.337199
C  -0.410348 -1.373647 0.380127
C  0.674678 -1.267505 -0.399572
C  1.986052 -0.706796 0.065681
H  2.182502 -0.92846 1.119956
H  2.847111 -1.03845 -0.522508
C  1.794562 0.831305 -0.124794
H  1.827905 1.09374 -1.188121
H  2.60313 1.378652 0.367074
C  0.43603 1.331021 0.498964
C  -0.756126 1.274329 -0.341632
H  0.514934 -1.190703 -1.479599
H  -1.830908 -1.140468 -1.246178
H  0.252192 0.883196 1.477837
H  -0.656344 1.63153 -1.371179
H  -2.870792 0.992593 -0.524369
H  0.55422 2.42617 0.663402
H  -0.317628 -1.44888 1.463053
totalener: -311.13910880 hartree
nucrepener: 379.06585541 hartree
electener: -690.20496421 hartree
oneelecener: -1158.55136142 hartree
twoeener: 468.34639722 hartree
kineticenergy: 309.72438051 hartree
exchangeener: -12.751937075287 hartree
correlationener: -0.942471467694 hartree
xcener: -13.694408542981 hartree
chargesum: 1.0000000
charge: -0.260882 0.199899 -0.241356 0.196078 -0.166290 -0.139886 -0.237963 0.161389 0.177244 -0.254237 0.159936 0.180406 -0.242902 0.095663 0.167829 0.186568 0.170143 0.242427 0.200768 0.214165 0.191002
charge: 0.124714 0.014627 0.157250 0.004426 0.029250 0.050227 0.069585 -0.003112 0.000037 0.108519 -0.009773 -0.000518 0.081585 0.326596 -0.017633 -0.001404 0.006313 0.023220 0.007511 0.050486 -0.021905
qa: -0.2609 0.1999 -0.2414 0.1961 -0.1663 -0.1399 -0.2380 0.1614 0.1772 -0.2542 0.1599 0.1804 -0.2429 0.0957 0.1678 0.1866 0.1701 0.2424 0.2008 0.2142 0.1910
va: 3.8771 0.9718 3.9082 0.9672 3.8176 3.8486 3.9030 0.9859 0.9766 3.8878 0.9827 0.9726 3.9201 3.5332 0.9823 0.9743 0.9903 0.9508 0.9743 0.9645 0.9788
energy: -311.839346484841
dipole: 0.28519 -1.10017 -0.81498 1.94750 -0.64707 1.30044 0.22951 -0.37183 -0.14232
magnitude: 1.54129 au
magnitude: 3.91765 debye
