program: Orca
programVersion: 5.0.3
elementType: C H C H C C C H H C H H C C H H H H H H H
charge: 1
multiplicity: 1
keywords: DSD-PBEP86/2013 cc-pVTZ EnGrad D3BJ RIJCOSX verytightscf cc-pVTZ/C def2/J soscf
formula: C8H13
InChI: InChI=1/C8H13/c1-2-4-6-8-7-5-3-1/h1-2,7H,3-6,8H2
21 atoms
C  -1.991048 0.554817 0.109132
H  -2.166798 0.739276 1.173377
C  -1.886703 -0.97704 -0.174874
H  -2.666281 -1.540739 0.343442
C  -0.47578 -1.241375 0.317789
C  0.630345 -1.19228 -0.472859
C  1.921237 -0.677611 0.071885
H  2.053537 -0.948197 1.124791
H  2.788934 -1.039038 -0.488654
C  1.851166 0.878844 -0.071542
H  1.921784 1.149227 -1.131914
H  2.700816 1.34663 0.433757
C  0.52321 1.464864 0.508136
C  -0.62047 1.023555 -0.301356
H  0.531925 -1.304691 -1.55288
H  -1.966973 -1.174136 -1.248672
H  0.389236 1.244379 1.57099
H  -0.491773 1.161998 -1.378865
H  -2.778434 1.039384 -0.47963
H  0.599335 2.563587 0.40027
H  -0.337244 -1.219875 1.40037
totalener: -311.15397778 hartree
nucrepener: 382.19449665 hartree
electener: -693.34847443 hartree
oneelecener: -1164.72768771 hartree
twoeener: 471.37921328 hartree
kineticenergy: 309.72588431 hartree
exchangeener: -14.121616472299 hartree
correlationener: -0.944781305966 hartree
xcener: -15.066397778264 hartree
chargesum: 1.0000000
charge: -0.225777 0.173731 -0.225475 0.181861 -0.101250 -0.126515 -0.242153 0.163254 0.180414 -0.245126 0.156319 0.181675 -0.231870 0.009067 0.212166 0.165260 0.170757 0.221241 0.184611 0.206166 0.191642
charge: 0.088132 0.003158 0.091571 -0.000546 0.115984 0.104340 0.073901 -0.000777 0.005701 0.103263 -0.006967 -0.000540 0.067120 0.313352 -0.008592 0.000099 0.002260 0.009974 0.007228 0.035755 -0.004418
qa: -0.2258 0.1737 -0.2255 0.1819 -0.1012 -0.1265 -0.2422 0.1633 0.1804 -0.2451 0.1563 0.1817 -0.2319 0.0091 0.2122 0.1653 0.1708 0.2212 0.1846 0.2062 0.1916
va: 3.8605 0.9825 3.8906 0.9757 3.8234 3.8302 3.9134 0.9851 0.9769 3.8844 0.9828 0.9723 3.9057 3.6283 0.9673 0.9866 0.9834 0.9628 0.9756 0.9659 0.9794
dispcorr: -0.014320528 hartree
energy: -311.840907583104
dipole: 0.54170 -0.86382 -0.32212 1.88888 -1.27868 0.61020 0.15573 -0.28911 -0.13338
magnitude: 0.70278 au
magnitude: 1.78632 debye
