program: Orca
programVersion: 5.0.3
elementType: C H C H C C C H H C H H C C H H H H H H H
charge: 1
multiplicity: 1
keywords: b3lyp cc-pVTZ EnGrad D3BJ RIJCOSX verytightscf cc-pVTZ/C def2/J soscf
formula: C8H13
InChI: InChI=1/C8H13/c1-2-4-6-8-7-5-3-1/h1-2,7H,3-6,8H2
21 atoms
C  -1.992638 0.518461 0.066236
H  -2.198588 0.793208 1.103964
C  -2.000169 -1.023444 -0.115935
H  -2.679187 -1.575199 0.534617
C  -0.542497 -1.0842 0.292665
C  0.570328 -1.057653 -0.530092
C  1.901363 -0.628065 0.011731
H  2.027185 -1.005446 1.032218
H  2.71703 -1.019818 -0.601062
C  1.936942 0.939041 0.025869
H  2.147062 1.304719 -0.985322
H  2.748016 1.285744 0.671259
C  0.567452 1.467847 0.492711
C  -0.490204 0.7071 -0.263952
H  0.463696 -1.27398 -1.592038
H  -2.159971 -1.32106 -1.155763
H  0.430154 1.368112 1.574808
H  -0.362627 0.803085 -1.345603
H  -2.646734 1.086252 -0.600313
H  0.469498 2.534359 0.248028
H  -0.360979 -1.025853 1.366424
totalener: -312.25286122 hartree
nucrepener: 387.55730452 hartree
electener: -699.81016574 hartree
oneelecener: -1175.89969764 hartree
twoeener: 476.08953191 hartree
kineticenergy: 310.02101654 hartree
exchangeener: -36.335167146075 hartree
correlationener: -2.310829957210 hartree
xcener: -38.645997103285 hartree
chargesum: 1.0000000
charge: -0.160733 0.143034 -0.183905 0.155783 -0.004026 -0.013699 -0.191268 0.137842 0.153402 -0.192631 0.135725 0.150281 -0.176170 -0.057561 0.188961 0.140493 0.129557 0.162489 0.153257 0.160027 0.169141
charge: 0.113902 -0.001492 0.113191 -0.002375 0.127019 0.180141 0.090842 0.001419 0.004930 0.100852 -0.007664 -0.001594 0.071668 0.184866 0.003568 -0.002171 -0.005407 0.003789 -0.003892 0.014472 0.013937
qa: -0.1607 0.1430 -0.1839 0.1558 -0.0040 -0.0137 -0.1913 0.1378 0.1534 -0.1926 0.1357 0.1503 -0.1762 -0.0576 0.1890 0.1405 0.1296 0.1625 0.1533 0.1600 0.1691
va: 3.8237 0.9912 3.8462 0.9838 3.7411 3.7288 3.8727 0.9883 0.9835 3.8464 0.9863 0.9816 3.8439 3.7159 0.9760 0.9917 0.9919 0.9975 0.9815 0.9764 0.9926
dispcorr: -0.034823890 hartree
energy: -312.287685108999
dipole: 0.55716 -0.70439 -0.14723 1.82918 -1.92699 -0.09782 0.23526 -0.40168 -0.16642
magnitude: 0.24278 au
magnitude: 0.61709 debye
