program: Orca
programVersion: 5.0.3
elementType: C H C H C C C H H C H H C C H H H H H H H
charge: 1
multiplicity: 1
keywords: DSD-PBEP86/2013 def2-TZVP D3BJ RIJCOSX verytightscf def2-TZVP/C def2/J soscf noTRAH
formula: C8H13
InChI: InChI=1/C8H13/c1-2-4-6-8-7-5-3-1/h1-2,7H,3-6,8H2
21 atoms
C  -1.996548 0.626198 0.079344
H  -2.174526 0.782765 1.149737
C  -1.796613 -0.951616 -0.171637
H  -2.640642 -1.451318 0.312903
C  -0.424184 -1.33545 0.365143
C  0.661894 -1.254692 -0.422574
C  1.962165 -0.704635 0.070855
H  2.143908 -0.940703 1.124392
H  2.828343 -1.034132 -0.513056
C  1.812115 0.839858 -0.112169
H  1.848772 1.098002 -1.176515
H  2.63403 1.369833 0.377087
C  0.461729 1.386421 0.505485
C  -0.716478 1.219628 -0.32828
H  0.521103 -1.231358 -1.506357
H  -1.85554 -1.144097 -1.247272
H  0.302146 1.016734 1.520568
H  -0.627809 1.567518 -1.36254
H  -2.841332 0.988554 -0.513172
H  0.608639 2.487067 0.553898
H  -0.313652 -1.395031 1.448472
totalener: -311.14223275 hartree
nucrepener: 379.68820234 hartree
electener: -690.83043508 hartree
oneelecener: -1159.82429301 hartree
twoeener: 468.99385793 hartree
kineticenergy: 310.01486135 hartree
exchangeener: -14.122862224708 hartree
correlationener: -0.943123103889 hartree
xcener: -15.065985328597 hartree
chargesum: 1.0000000
charge: -0.215593 0.180986 -0.215828 0.178670 -0.181043 -0.140285 -0.208875 0.154768 0.164361 -0.256041 0.152939 0.173192 -0.155558 0.112833 0.150712 0.171183 0.162464 0.217566 0.184296 0.204495 0.164757
charge: -0.186750 0.167081 -0.177957 0.152207 -0.137909 -0.143396 -0.219784 0.149687 0.152408 -0.192403 0.144156 0.150551 -0.206980 0.198356 0.151978 0.152339 0.160341 0.176038 0.160969 0.199198 0.149872
qa: -0.2156 0.1810 -0.2158 0.1787 -0.1810 -0.1403 -0.2089 0.1548 0.1644 -0.2560 0.1529 0.1732 -0.1556 0.1128 0.1507 0.1712 0.1625 0.2176 0.1843 0.2045 0.1648
va: 3.8507 0.9639 3.8557 0.9664 3.8689 3.8454 3.8842 0.9727 0.9719 3.8877 0.9690 0.9631 3.8349 3.4871 0.9666 0.9681 0.9800 0.9372 0.9672 0.9537 0.9648
total: -311.793084463 hartree
dispcorr: -0.014147035 hartree
energy: -311.807231497648
dipole: 0.40603 -1.05909 -0.65306 1.97897 -0.58113 1.39785 0.15738 -0.33695 -0.17957
magnitude: 1.55329 au
magnitude: 3.94814 debye
