program: Orca
programVersion: 5.0.3
elementType: C H C H C C C H H C H H C C H H H H H H H
charge: 1
multiplicity: 1
keywords: m062x cc-pVTZ EnGrad RIJCOSX verytightscf cc-pVTZ/C def2/J soscf
formula: C8H13
InChI: InChI=1/C8H13/c1-2-4-6-8-7-5-3-1/h1-2,7H,3-6,8H2
21 atoms
C  -1.993731 0.542917 0.116685
H  -2.169328 0.730384 1.17987
C  -1.916595 -0.98534 -0.174085
H  -2.671379 -1.563779 0.36289
C  -0.4939 -1.200301 0.300882
C  0.621676 -1.163929 -0.487783
C  1.913745 -0.666894 0.069986
H  2.030603 -0.950456 1.12135
H  2.777913 -1.041283 -0.486484
C  1.868352 0.893629 -0.055685
H  1.960081 1.172481 -1.112266
H  2.72004 1.338571 0.46612
C  0.539552 1.477009 0.501445
C  -0.588693 0.938691 -0.286293
H  0.533556 -1.30894 -1.564343
H  -2.011356 -1.184745 -1.24602
H  0.412613 1.303903 1.574436
H  -0.453185 1.020859 -1.367982
H  -2.754035 1.066339 -0.473836
H  0.570449 2.570174 0.344334
H  -0.349433 -1.159668 1.38213
totalener: -312.30463727 hartree
nucrepener: 383.52363496 hartree
electener: -695.82827224 hartree
oneelecener: -1167.69147532 hartree
twoeener: 471.86320308 hartree
kineticenergy: 310.01984904 hartree
xcener: -23.092901548776 hartree
chargesum: 1.0000000
charge: -0.267496 0.194530 -0.277258 0.189332 -0.097768 -0.085899 -0.311698 0.189589 0.190482 -0.269862 0.180332 0.191929 -0.307203 -0.008906 0.231861 0.187799 0.200929 0.238381 0.192701 0.222721 0.215504
charge: 0.088965 0.002627 0.092913 0.000408 0.116546 0.122813 0.074784 0.001422 0.006949 0.098933 -0.005236 0.000928 0.064046 0.285423 -0.004405 0.001203 0.002861 0.008186 0.006114 0.033596 0.000926
qa: -0.2675 0.1945 -0.2773 0.1893 -0.0978 -0.0859 -0.3117 0.1896 0.1905 -0.2699 0.1803 0.1919 -0.3072 -0.0089 0.2319 0.1878 0.2009 0.2384 0.1927 0.2227 0.2155
va: 3.7196 0.9591 3.7546 0.9596 3.6417 3.6191 3.7885 0.9578 0.9603 3.7218 0.9558 0.9517 3.7548 3.4836 0.9395 0.9632 0.9527 0.9397 0.9573 0.9457 0.9509
energy: -312.304637273810
dipole: 0.55903 -0.81868 -0.25965 1.86640 -1.42548 0.44092 0.16869 -0.30926 -0.14057
magnitude: 0.53065 au
magnitude: 1.34880 debye
