program: Gaussian 09
title: 000050879
version: EM64L-G09RevD.01
frameworkgroup: C1[X(C18H24N2O3)]
method: RPBEPBE
basis: SDD
operation: Freq
keyword: #p
keyword: freq=noraman
keyword: PBEPBE/SDD
title: #p freq=noraman PBEPBE/SDD
converged: YES YES NO NO
title: Mulliken charges:
elementType: O O O N N C C C C C C C C C C C C C C C C C C H H H H H H H H H H H H H H H H H H H H H H H H
charge: -0.255074 -0.265442 -0.260155 -0.081063 -0.063635 -0.335249 -0.346204 -0.388041 -0.380994 -0.465601 0.229636 -0.614176 0.074502 0.181536 0.209818 -0.383998 -0.412348 0.025569 0.104060 0.254032 -0.824485 -0.808349 -0.536999 0.213684 0.188452 0.183421 0.198815 0.202930 0.186563 0.183758 0.202811 0.213759 0.225232 0.220920 0.186009 0.221661 0.243806 0.280306 0.225522 0.225166 0.284552 0.254805 0.247932 0.253242 0.248207 0.224585 0.226523
chargesum: 0.00000
title: Mulliken charges with hydrogens summed into heavy atoms:
elementType: O O O N N C C C C C C C C C C C C C C C C C C
charge: -0.255074 -0.265442 -0.260155 -0.081063 -0.063635 0.066887 0.036032 0.001453 0.005575 -0.026609 0.229636 0.014414 0.074502 0.181536 0.209818 -0.140193 -0.132042 0.025569 0.104060 0.254032 -0.089246 -0.052371 0.162316
polarizability: 2.61861955e+02 1.73595976e+01 2.59523032e+02 -2.66092637e+01 1.47450156e+01 1.59501669e+02
1716.lowfreq: -31.9523 -4.8961 -0.0006 0.0002 0.0006 5.0909 12.7560 24.9253 36.4850
frequency: -28.3217 24.6100 36.4229 58.4647 66.8717 80.4207 97.9801 100.6928 118.3890 132.5297 153.5980 164.1910 187.1774 207.9918 217.0371 235.2912 254.3081 280.0460 288.9467 293.6555 298.1900 307.3926 324.4051 339.9555 347.9565 353.2660 359.8145 384.9696 425.2937 446.4860 483.1553 494.9269 508.0096 546.9143 565.4683 588.0989 611.6088 613.7011 619.8938 648.3770 717.2552 728.0084 751.5828 770.5180 795.4767 816.7214 829.3048 848.7473 873.6876 909.0752 945.6477 976.8636 978.1281 992.9209 1002.1558 1016.1050 1027.0160 1032.4702 1048.3065 1054.7546 1063.3226 1077.2404 1086.7010 1110.7142 1112.2972 1129.7233 1135.5790 1144.0922 1147.8320 1149.7932 1167.2976 1184.7933 1191.8632 1196.0319 1211.8513 1245.3094 1249.5696 1266.4584 1279.9709 1290.6490 1305.2205 1332.5803 1345.2801 1356.9269 1366.1512 1372.8075 1389.7686 1391.9085 1395.8819 1404.2596 1425.8938 1429.1706 1440.1229 1448.3624 1450.1519 1451.6144 1455.1391 1457.8088 1458.4966 1468.7542 1469.0972 1470.9627 1472.8944 1473.0991 1480.6770 1486.6035 1494.5903 1544.6782 1578.4850 1615.6610 1634.2746 2840.8897 2846.0570 2856.1932 2863.2763 2878.2631 2916.0522 2967.3365 2980.0858 2990.3333 3014.2208 3020.3451 3023.9226 3027.4194 3035.3035 3047.6407 3058.8031 3061.0559 3066.0735 3072.4093 3094.0120 3128.1463 3128.3924 3152.4138 3173.6687
redmass: 2.7887 4.5415 4.6872 3.3765 1.0308 3.6138 3.7792 3.3882 1.2099 4.3820 3.4749 3.7590 3.4457 1.3624 2.2005 1.2790 1.8841 2.4502 3.6550 2.7812 3.5305 2.8414 4.0128 3.4482 3.4298 4.2630 2.6807 1.9730 4.5370 5.3751 3.2018 5.7579 4.0808 4.3239 4.2050 4.9783 5.2444 2.6487 4.7662 4.2192 4.4995 6.2872 3.8933 3.2627 4.2692 4.8697 1.7319 1.5338 3.2661 2.4737 2.5726 1.3774 2.5889 2.0227 2.5135 2.6392 2.5671 1.4207 1.6092 1.5421 2.1721 1.8485 1.9289 2.1195 1.2703 2.6413 1.9012 2.1901 1.9141 2.5504 4.1033 1.4519 1.2112 1.8073 2.0038 4.3689 3.6589 1.7034 1.5104 1.4579 1.3050 1.2936 1.3255 3.1906 1.4291 1.4381 1.3882 2.1024 2.6187 1.3574 2.8874 1.1664 1.3836 1.0821 1.0788 1.1052 1.1082 1.0469 1.0735 1.0899 1.1724 1.0951 1.0702 1.1048 1.0538 2.1720 1.0470 10.5632 8.8137 7.5280 7.7890 1.0700 1.0633 1.0686 1.0657 1.0684 1.0683 1.0325 1.0368 1.0389 1.0724 1.0901 1.0876 1.0893 1.0901 1.0886 1.1043 1.0987 1.0971 1.1009 1.0979 1.0974 1.1001 1.0879 1.0957
irintensity: 0.0087 0.0364 1.3124 4.9740 0.1037 0.6196 1.6406 3.0298 0.1116 7.9328 1.3806 2.0576 0.1838 0.4402 1.3245 0.6500 0.3543 1.8300 0.0563 0.7774 2.3702 10.7875 3.7760 1.4228 0.4495 4.0084 4.5737 0.6735 2.5902 3.7869 0.6181 7.0268 6.0465 8.9456 7.8204 2.3790 0.8277 0.1896 3.4985 6.1498 7.8600 9.9701 6.3777 25.6990 15.3422 6.2583 22.8761 0.0280 4.2335 9.0242 11.8202 1.1722 4.4526 4.3283 55.8821 10.9464 5.3968 5.2838 1.8431 0.6131 69.4569 59.3635 100.2595 41.5229 1.7793 14.9584 3.0289 4.8411 32.4295 39.7607 149.7011 1.2602 4.4745 22.8940 4.1318 130.5694 1.8645 3.0917 11.2181 47.9114 1.5660 19.7698 11.3872 154.2144 5.5680 4.2716 28.8064 30.0150 68.1085 74.9112 20.0340 1.3620 4.4882 0.3442 0.2767 7.8309 25.8329 12.3320 20.9624 19.9930 40.8327 15.1432 38.7939 10.7060 7.8515 0.1332 9.5734 183.1768 29.0564 156.4513 160.3319 72.9360 55.6878 25.2061 137.8035 186.0671 79.0101 74.8134 39.5268 11.4786 49.1907 28.1932 87.8822 37.1130 13.9430 29.5619 39.9393 24.7297 6.9433 35.6577 2.2376 12.8855 18.4573 0.7882 12.5584
temp: 298.150 k
press: 1.00000 atm
elementType: 8 8 8 7 7 6 6 6 6 6 6 6 6 6 6 6 6 6 6 6 6 6 6 1 1 1 1 1 1 1 1 1 1 1 1 1 1 1 1 1 1 1 1 1 1 1 1
symmnumber: 1
zpe: 1022400.3 jmol-1
zpe.correction: 0.389412 hartree
zpe.thermalcorrener: 0.411542 hartree
zpe.thermalcorrenthalpy: 0.412487 hartree
zpe.thermalcorrgfe: 0.338357 hartree
zpe.sumelectzpe: -1033.718793 hartree
zpe.sumelectthermal: -1033.696662 hartree
zpe.sumelectthermalent: -1033.695718 hartree
zpe.sumelectthermalfe: -1033.769847 hartree
dipole: 3.0853 0.4003 -1.4330
dipole: 3.4254
quadrupole: -158.2828 -105.6923 -137.3504
quadrupole: 5.7279 10.2446 4.1851
quadrupole: -24.5077 28.0829 -3.5752 5.7279 10.2446 4.1851
hfenergy: -1034.1082045 hartree
pointgroup: C01 [X(C18H24N2O3)]
dipole: 1.1684532 -0.5260479 0.4172957 debye
polarizability: 256.5851345|-18.5814933|263.0213193|20.8199474|24.8332902|161.2802023 unknown
InChI: InChI=1S/C18H24N2O3/c1-12-13(2)23-18-14(17(12)21)5-6-16(22-4)15(18)11-20-9-7-19(3)8-10-20/h5-6H,7-11H2,1-4H3
charge 0 multiplicity 1
47 atoms
O  -0.762437 1.326029 1.162572
O  0.131506 -3.279412 0.252964
O  -4.475141 1.208318 -0.731993
N  2.056668 -0.173593 0.493835
N  4.630367 0.180008 -0.788862
C  2.452941 -1.003225 -0.670871
C  3.253608 0.230167 1.272625
C  3.433682 -0.227472 -1.563796
C  4.235939 1.003438 0.377874
C  1.039629 -0.833698 1.363827
C  -0.30813 -0.974477 0.678267
C  5.645507 0.843965 -1.627164
C  -1.192463 0.125956 0.57302
C  -0.756726 -2.202774 0.12284
C  -2.457878 0.056393 -0.066763
C  -2.023672 -2.31291 -0.522936
C  -2.853324 -1.188417 -0.615769
C  -3.333997 1.247774 -0.154468
C  -2.805334 2.483666 0.467694
C  -1.573381 2.472644 1.088688
C  -3.66403 3.730521 0.394533
C  -0.89084 3.622449 1.772803
C  -0.275763 -4.583946 -0.278585
H  1.548705 -1.256649 -1.252084
H  2.932074 -1.960609 -0.34624
H  3.785219 -0.656515 1.704133
H  2.929146 0.87797 2.109218
H  3.758196 -0.873159 -2.401799
H  2.902882 0.66033 -1.994973
H  3.751617 1.962727 0.058973
H  5.144116 1.254648 0.958287
H  0.917168 -0.190281 2.254062
H  1.380426 -1.838235 1.70559
H  6.540526 1.070911 -1.019734
H  5.286426 1.801696 -2.084689
H  5.951505 0.168962 -2.446924
H  -2.352245 -3.264618 -0.948769
H  -3.829666 -1.234483 -1.108821
H  -3.158964 4.552639 -0.145367
H  -3.944121 4.103713 1.396857
H  -4.588796 3.476779 -0.149712
H  0.10469 3.797296 1.325625
H  -0.731632 3.398066 2.843946
H  -1.486544 4.542859 1.69053
H  0.56201 -5.257317 -0.046099
H  -0.428109 -4.542834 -1.373991
H  -1.196962 -4.949298 0.213949
