program: Orca
programVersion: 5.0.3
elementType: C H C H C C C H H C H H C C H H H H H H H
charge: 1
multiplicity: 1
keywords: PBE0 def2-TZVP EnGrad D3BJ RIJCOSX verytightscf def2/J soscf
formula: C8H13
InChI: InChI=1/C8H13/c1-2-4-6-8-7-5-3-1/h1-2,7H,3-6,8H2
21 atoms
C  -1.996548 0.626198 0.079344
H  -2.174526 0.782765 1.149737
C  -1.796613 -0.951616 -0.171637
H  -2.640642 -1.451318 0.312903
C  -0.424184 -1.33545 0.365143
C  0.661894 -1.254692 -0.422574
C  1.962165 -0.704635 0.070855
H  2.143908 -0.940703 1.124392
H  2.828343 -1.034132 -0.513056
C  1.812115 0.839858 -0.112169
H  1.848772 1.098002 -1.176515
H  2.63403 1.369833 0.377087
C  0.461729 1.386421 0.505485
C  -0.716478 1.219628 -0.32828
H  0.521103 -1.231358 -1.506357
H  -1.85554 -1.144097 -1.247272
H  0.302146 1.016734 1.520568
H  -0.627809 1.567518 -1.36254
H  -2.841332 0.988554 -0.513172
H  0.608639 2.487067 0.553898
H  -0.313652 -1.395031 1.448472
totalener: -312.05096976 hartree
nucrepener: 379.68820234 hartree
electener: -691.73917210 hartree
oneelecener: -1160.43670786 hartree
twoeener: 468.69753575 hartree
kineticenergy: 310.15528681 hartree
exchangeener: -34.168746996981 hartree
correlationener: -1.961766788286 hartree
xcener: -36.130513785267 hartree
chargesum: 1.0000000
charge: -0.198612 0.180726 -0.218534 0.177960 -0.165449 -0.117260 -0.214464 0.159493 0.169417 -0.259338 0.160622 0.175737 -0.142813 0.046062 0.149132 0.172905 0.163974 0.207231 0.183556 0.206744 0.162909
charge: -0.194076 0.172816 -0.185535 0.157375 -0.128930 -0.141469 -0.225474 0.156305 0.161770 -0.197632 0.151625 0.157182 -0.213209 0.140567 0.158199 0.158431 0.165401 0.175918 0.166650 0.209177 0.154908
qa: -0.1986 0.1807 -0.2185 0.1780 -0.1654 -0.1173 -0.2145 0.1595 0.1694 -0.2593 0.1606 0.1757 -0.1428 0.0461 0.1491 0.1729 0.1640 0.2072 0.1836 0.2067 0.1629
va: 3.8990 0.9647 3.8958 0.9662 3.9416 3.9041 3.9324 0.9703 0.9704 3.9585 0.9667 0.9621 3.8886 3.6959 0.9661 0.9684 0.9789 0.9429 0.9669 0.9534 0.9641
dispcorr: -0.018856394 hartree
energy: -312.069826158732
dipole: 0.40603 -0.93626 -0.53022 1.97897 -0.74721 1.23176 0.15738 -0.28089 -0.12351
magnitude: 1.34671 au
magnitude: 3.42306 debye
